Console Output
Skipping 238 KB..
Full LogTestTestTestTestTestTestTestTestTestTestTestTestTestTestTestTest (hide)Test (hide)Test (hide)Test (hide)Test (hide)TestTestTestTestTest (hide)Test (hide)Test (hide)Test (hide)Test (hide)Test (Report Completion) (hide)Test (hide)TestTestTest (hide)TestTestTestTestTestTestTestTestTestTestTestTestTestTestTestTestTestTestTestTestTestTestTestTestTestTestTestTestTestTestTestTestTestTestTestTestTestTestTestTestTestTestTestTestTestTestTestTestTestTestTestTestTestTestTestTestTestTestTestTestTestTestTestTestTestTestTestTestTestTestTestTestTestTestTestTestTestTestTestTestTestTestTestTestTestTestTestTestTestTestTestTestTestTestTestTestTestTestTestTestTestTestTestTestTestTestTestTestTestTestTestTestTestTestTestTestTestTestTestTestTestTestTestTestTestTestTestTestTestTestTestTestTestTestTestTestTestTestTestTestTestTestTestTestTestTestTestTestTestTestTestTestTestTestTestTestTestTestTestTestTestTestTestTestTestTestTestTestTestTestTestTestTestTestTestTestTestTestTestTestTestTestTestTestTestTestTestTestTestTestTestTestTestTestTestTestTest 16:04:42 [2025-04-03T16:04:42.919Z] Running: rpm-ostree compose container-encapsulate --max-layers=50 --format-version=1 --repo=/home/jenkins/agent/workspace/test-override/tmp/repo --label=coreos-assembler.image-config-checksum=c3645355120b999e10e5bf1b5dfd2a15bc3c4534eaa1e88b6017849d93e3020b --label=coreos-assembler.image-input-checksum=3924f175017e709137843c15a50d71109c61dc569d4c2c9c51e2e0f4d438c34c --label=org.opencontainers.image.source=https://github.com/coreos/fedora-coreos-config --label=org.opencontainers.image.revision=ace3f737d74d81949d8a7c4be82fc2511dad8121 --copymeta-opt=fedora-coreos.stream 43.20250403.dev.0 oci-archive:fedora-coreos-43.20250403.dev.0-ostree.x86_64.ociarchive.tmp:latest
16:04:57 [2025-04-03T16:04:57.741Z] Building package mapping...done
16:04:57 [2025-04-03T16:04:57.741Z] 21520 objects in 444 packages (283 source)
16:04:57 [2025-04-03T16:04:57.741Z] rpm size: 1463548360
16:04:57 [2025-04-03T16:04:57.741Z] Earliest changed package: shim-x64-15.8-3.x86_64 at 2024-03-19 20:21:09 UTC
16:04:57 [2025-04-03T16:04:57.741Z] Duplicates: 1308
16:04:57 [2025-04-03T16:04:57.741Z] Multiple owners: 108
16:04:58 [2025-04-03T16:04:58.297Z] Generating container image
16:05:44 [2025-04-03T16:05:44.874Z] Pushed digest: sha256:bff4c7f51e4e3bc3385ffa0141e1bd4e186bd850db57d5b4fe439a385aaae9cd
16:05:46 [2025-04-03T16:05:46.231Z] Total objects: 25512
16:05:46 [2025-04-03T16:05:46.231Z] No unreachable objects
16:05:46 [2025-04-03T16:05:46.484Z] renamed 'commitmeta.json' -> '/home/jenkins/agent/workspace/test-override/builds/43.20250403.dev.0/x86_64/commitmeta.json'
16:05:46 [2025-04-03T16:05:46.484Z] renamed 'ostree-commit-object' -> '/home/jenkins/agent/workspace/test-override/builds/43.20250403.dev.0/x86_64/ostree-commit-object'
16:05:46 [2025-04-03T16:05:46.484Z] renamed 'manifest-lock.generated.x86_64.json' -> '/home/jenkins/agent/workspace/test-override/builds/43.20250403.dev.0/x86_64/manifest-lock.generated.x86_64.json'
16:05:46 [2025-04-03T16:05:46.484Z] renamed 'coreos-assembler-config-git.json' -> '/home/jenkins/agent/workspace/test-override/builds/43.20250403.dev.0/x86_64/coreos-assembler-config-git.json'
16:05:46 [2025-04-03T16:05:46.484Z] renamed 'coreos-assembler-config.tar.gz' -> '/home/jenkins/agent/workspace/test-override/builds/43.20250403.dev.0/x86_64/coreos-assembler-config.tar.gz'
16:05:46 [2025-04-03T16:05:46.484Z] renamed 'fedora-coreos-43.20250403.dev.0-ostree.x86_64.ociarchive' -> '/home/jenkins/agent/workspace/test-override/builds/43.20250403.dev.0/x86_64/fedora-coreos-43.20250403.dev.0-ostree.x86_64.ociarchive'
16:05:46 [2025-04-03T16:05:46.484Z] renamed 'fedora-coreos-43.20250403.dev.0-ostree.x86_64-manifest.json' -> '/home/jenkins/agent/workspace/test-override/builds/43.20250403.dev.0/x86_64/fedora-coreos-43.20250403.dev.0-ostree.x86_64-manifest.json'
16:05:46 [2025-04-03T16:05:46.484Z] renamed 'meta.json' -> '/home/jenkins/agent/workspace/test-override/builds/43.20250403.dev.0/x86_64/meta.json'
16:05:46 [2025-04-03T16:05:46.739Z] info: Missing CAP_SYS_ADMIN; using virt
16:05:46 [2025-04-03T16:05:46.993Z] Config commit: ace3f737d74d81949d8a7c4be82fc2511dad8121
16:05:46 [2025-04-03T16:05:46.993Z] Using manifest: /home/jenkins/agent/workspace/test-override/src/config/manifest.yaml
16:05:47 [2025-04-03T16:05:47.915Z] Will build qemu
16:05:49 [2025-04-03T16:05:49.270Z] Estimating disk size...
16:05:51 [2025-04-03T16:05:51.147Z] Disk sizes: metal: 2727M (estimated), cloud: 10240M
16:06:09 [2025-04-03T16:06:09.173Z] ++ arch
16:06:09 [2025-04-03T16:06:09.173Z] + osbuild-mpp -D 'arch="x86_64"' -D 'artifact_name_prefix="fedora-coreos-43.20250403.dev.0"' -D 'build_version="43.20250403.dev.0"' -D 'ostree_ref=""' -D 'ostree_repo=""' -D 'ociarchive="/home/jenkins/agent/workspace/test-override/builds/43.20250403.dev.0/x86_64/fedora-coreos-43.20250403.dev.0-ostree.x86_64.ociarchive"' -D 'osname="fedora-coreos"' -D 'container_imgref="ostree-remote-registry:fedora:quay.io/fedora/fedora-coreos:rawhide"' -D 'container_repo=""' -D 'container_tag=""' -D 'extra_kargs="mitigations=auto,nosmt"' -D metal_image_size_mb=2727 -D cloud_image_size_mb=10240 -D rootfs_size_mb=2214 /usr/lib/coreos-assembler/osbuild-manifests/coreos.osbuild.x86_64.mpp.yaml /tmp/osbuild-oYzu.json
16:06:10 [2025-04-03T16:06:10.093Z] + set +x
16:06:10 [2025-04-03T16:06:10.093Z] + osbuild --out cache/osbuild/out --store cache/osbuild/store --cache-max-size 20GiB --checkpoint deployed-tree --checkpoint tree --checkpoint raw-image --checkpoint metal --checkpoint metal4k --export=qemu /tmp/osbuild-oYzu.json
16:06:10 [2025-04-03T16:06:10.093Z] [33m
16:06:10 [2025-04-03T16:06:10.093Z] Filesystem Size Used Avail Use% Mounted on
16:06:10 [2025-04-03T16:06:10.093Z] /dev/vdb1 40G 3.1G 37G 8% /home/jenkins/agent/workspace/test-override/cache
16:06:10 [2025-04-03T16:06:10.093Z] [39m
16:06:10 [2025-04-03T16:06:10.345Z] starting /tmp/osbuild-oYzu.jsonPipeline source org.osbuild.curl: 4462ce13868655c4b3beaa8ac67488f9bde7e53ef2c7e5cd6d0a79fae94e681b
16:06:10 [2025-04-03T16:06:10.345Z] Build
16:06:10 [2025-04-03T16:06:10.345Z] root: <host>
16:06:13 [2025-04-03T16:06:13.595Z] source/org.osbuild.curl (org.osbuild.curl): Downloaded file:///home/jenkins/agent/workspace/test-override/builds/43.20250403.dev.0/x86_64/fedora-coreos-43.20250403.dev.0-ostree.x86_64.ociarchive
16:06:13 [2025-04-03T16:06:13.595Z]
16:06:13 [2025-04-03T16:06:13.595Z] ��� Duration: 1743696372s
16:06:13 [2025-04-03T16:06:13.595Z] Pipeline oci-archive: 449be0351686951c8e3f8b4ccd63b74ced6263783d71e80227f7a0f0ebb2b4db
16:06:13 [2025-04-03T16:06:13.595Z] Build
16:06:13 [2025-04-03T16:06:13.595Z] root: <host>
16:06:13 [2025-04-03T16:06:13.595Z] runner: org.osbuild.fedora38 (org.osbuild.fedora38)
16:06:13 [2025-04-03T16:06:13.595Z] org.osbuild.copy: 449be0351686951c8e3f8b4ccd63b74ced6263783d71e80227f7a0f0ebb2b4db {
16:06:13 [2025-04-03T16:06:13.595Z] "paths": [
16:06:13 [2025-04-03T16:06:13.595Z] {
16:06:13 [2025-04-03T16:06:13.595Z] "from": "input://inlinefile/sha256:6dcecc1b4a0befa51587ae8b22909294322533dffdd4e1645b711af07d457cf2",
16:06:13 [2025-04-03T16:06:13.595Z] "to": "tree:///coreos.ociarchive"
16:06:13 [2025-04-03T16:06:13.595Z] }
16:06:13 [2025-04-03T16:06:13.595Z] ]
16:06:13 [2025-04-03T16:06:13.595Z] }
16:06:13 [2025-04-03T16:06:13.595Z] Failed to open file "/sys/fs/selinux/checkreqprot": Read-only file system
16:06:13 [2025-04-03T16:06:13.849Z] copying '/run/osbuild/inputs/inlinefile/sha256:6dcecc1b4a0befa51587ae8b22909294322533dffdd4e1645b711af07d457cf2' -> '/run/osbuild/tree/coreos.ociarchive'
16:06:14 [2025-04-03T16:06:14.102Z]
16:06:14 [2025-04-03T16:06:14.102Z] ��� Duration: 0s
16:06:14 [2025-04-03T16:06:14.102Z] Pipeline deployed-tree: a2b7ce38d2a7aadb73aabc15160635211e7f6be036d36855a2e801ff2aa1abe0
16:06:14 [2025-04-03T16:06:14.102Z] Build
16:06:14 [2025-04-03T16:06:14.102Z] root: <host>
16:06:14 [2025-04-03T16:06:14.102Z] runner: org.osbuild.fedora38 (org.osbuild.fedora38)
16:06:14 [2025-04-03T16:06:14.102Z] org.osbuild.container-deploy: a2b7ce38d2a7aadb73aabc15160635211e7f6be036d36855a2e801ff2aa1abe0 {}
16:06:14 [2025-04-03T16:06:14.102Z] input/images (org.osbuild.containers): target /home/jenkins/agent/workspace/test-override/cache/osbuild/store/tmp/buildroot-tmp-fpkowta5/inputs/images
16:06:14 [2025-04-03T16:06:14.102Z] Failed to open file "/sys/fs/selinux/checkreqprot": Read-only file system
16:06:14 [2025-04-03T16:06:14.658Z] time="2025-04-03T16:06:13Z" level=info msg="Not using native diff for overlay, this may cause degraded performance for building images: kernel has CONFIG_OVERLAY_FS_REDIRECT_DIR enabled"
16:06:17 [2025-04-03T16:06:17.160Z] Getting image source signatures
16:06:17 [2025-04-03T16:06:17.160Z] Copying blob sha256:27be145f46897585fdbbf146745e608aa74374e169558607679a1873006cd135
16:06:18 [2025-04-03T16:06:18.081Z] Copying blob sha256:aab5ce09aecad74a10ca3002622fbde68a1fd068fc08b79bd8035aaaf3a6b980
16:06:19 [2025-04-03T16:06:19.438Z] Copying blob sha256:c88b5d6848b74b76df193205bf4f073f7e5264635f899c3950c7cfd900f7d49b
16:06:19 [2025-04-03T16:06:19.994Z] [33m
16:06:19 [2025-04-03T16:06:19.994Z] Filesystem Size Used Avail Use% Mounted on
16:06:19 [2025-04-03T16:06:19.994Z] /dev/vdb1 40G 5.0G 35G 13% /home/jenkins/agent/workspace/test-override/cache
16:06:19 [2025-04-03T16:06:19.994Z] [39m
16:06:20 [2025-04-03T16:06:20.913Z] Copying blob sha256:f0b141d1b2dccc8a9e49f5d40e594d0720c71af8b85302e5cfb5df08501fc34c
16:06:22 [2025-04-03T16:06:22.268Z] Copying blob sha256:488dc13e201c92dcd3094783e2d40d97287423e990e91ce10a86b7c337311409
16:06:23 [2025-04-03T16:06:23.646Z] Copying blob sha256:484335fb49b8531a1e77305354a774bd750313e14b3943abd13a1a4662eb7de0
16:06:24 [2025-04-03T16:06:24.567Z] Copying blob sha256:70c3aefdccaed7bd16fe635e97d467ff99cb4274cfdb3c80e546f831cf61a6d9
16:06:25 [2025-04-03T16:06:25.124Z] Copying blob sha256:3afc79a17c5227fb874ff4bc56ef7cc07221402522e789e4723738517d0119c1
16:06:25 [2025-04-03T16:06:25.682Z] Copying blob sha256:ffa7178e57c5df905c94005f7be2f16605092da1877c8ef171153a468929cdbb
16:06:26 [2025-04-03T16:06:26.239Z] Copying blob sha256:be7b499d203798de8b25193dfcb0fa4d1b6e5ab6a2c4e87fec2e9553dd2752bf
16:06:26 [2025-04-03T16:06:26.492Z] Copying blob sha256:f29802b0738633ca380855b417ce0f9cd7a3e0aca386857acd5c73fd04d79fc9
16:06:27 [2025-04-03T16:06:27.049Z] Copying blob sha256:2af1029f58b4d930df413eaf4d2484cb29ae9cbf504f5e343e43440dd79b4429
16:06:27 [2025-04-03T16:06:27.605Z] Copying blob sha256:873fdbf26fce6e14a87b98920a535a5cdbab8db5c592e9e3381df7cadcda777d
16:06:28 [2025-04-03T16:06:28.162Z] Copying blob sha256:879d6c56b75540589baaebcecfb8bd9daadbbbdc54af89438583ffdcc5e9819d
16:06:28 [2025-04-03T16:06:28.718Z] Copying blob sha256:0d9c472c40bf2d3568227d7cbd2d6e5cb95690573a3fa5e8fcdd1186321de7a0
16:06:28 [2025-04-03T16:06:28.971Z] Copying blob sha256:435500fc40970578d93d6ea5f1dcf2afa76bb0fb4c8c0225651550e4208cc9ac
16:06:29 [2025-04-03T16:06:29.890Z] Copying blob sha256:f37cee604a9c4a21998eb982b2d3175d5dfb215a9e513b7d1e7d7f5f8a6f2fa5
16:06:30 [2025-04-03T16:06:30.143Z] [33m
16:06:30 [2025-04-03T16:06:30.143Z] Filesystem Size Used Avail Use% Mounted on
16:06:30 [2025-04-03T16:06:30.143Z] /dev/vdb1 40G 6.1G 34G 16% /home/jenkins/agent/workspace/test-override/cache
16:06:30 [2025-04-03T16:06:30.143Z] [39m
16:06:30 [2025-04-03T16:06:30.143Z] Copying blob sha256:1ff36ac9273e660cc8501ddd72030d4ce0c4bc62145fe55d1052ac8f42254053
16:06:30 [2025-04-03T16:06:30.699Z] Copying blob sha256:6782538afa9d4fda7a85362161013b0eaf59651448e834a7e5e4801039b3067b
16:06:30 [2025-04-03T16:06:30.952Z] Copying blob sha256:0a313c0ac65131d27840ed141f78aa1c91ac3c59cb1d5e6d57bf92b0f9c8c471
16:06:31 [2025-04-03T16:06:31.205Z] Copying blob sha256:16c86f09e5cba7bcb96d6b18bac50a9e4a23f3b72468a5a806573ceb6396efa9
16:06:31 [2025-04-03T16:06:31.457Z] Copying blob sha256:bd9b22dc8c8b071e3c101be4d62ff61eb199511887ebd09608408d5f5b5a4e0e
16:06:31 [2025-04-03T16:06:31.711Z] Copying blob sha256:05ef3638ea664cfabd3ed901f9ce79e6453f5ae61b327e8c23bbeb9ac81718e9
16:06:31 [2025-04-03T16:06:31.964Z] Copying blob sha256:e5213377723e56a4ca9c0e1af17e7d6da4f6b87de1f5f0b58ab1b4d51f0c1fed
16:06:32 [2025-04-03T16:06:32.217Z] Copying blob sha256:bd309b0b9bacfc9cc80212bd3d4793b2465589e72a37a97825b28817bc35b9b3
16:06:32 [2025-04-03T16:06:32.471Z] Copying blob sha256:f4104e37af78c074f16b05a2215a9b2fa672f2fefa4d6711d24c2343a9b4efa6
16:06:32 [2025-04-03T16:06:32.725Z] Copying blob sha256:a732cbddfe6765c2c604e1211ce2846f8132d35ed4a07c8aa587ca69b4d5aa31
16:06:32 [2025-04-03T16:06:32.978Z] Copying blob sha256:0e2c69551c56efd9f1b5694c899441f90a76aedcd57820c3c797280992242ebb
16:06:33 [2025-04-03T16:06:33.232Z] Copying blob sha256:585f6fa150114ccc0754a5e5e055175f8ef289800607459e0a0148ada99d5fad
16:06:33 [2025-04-03T16:06:33.485Z] Copying blob sha256:3f5274657cee4b5c09a85977e2317726af59571bcc3a4e27b670d604e1074c83
16:06:34 [2025-04-03T16:06:34.042Z] Copying blob sha256:34194a611306427d10d33696b176dfdf3b3f9edc599940b2a5ac07964d9da28e
16:06:34 [2025-04-03T16:06:34.042Z] Copying blob sha256:8d86b4ecd801ae1ac0bba87e2155055e5b85dafea836ce44487e142ebc73b753
16:06:34 [2025-04-03T16:06:34.296Z] Copying blob sha256:a0792c2501fde2c8e378859f9ba38093013e4342948d74ac5b080ffdd149289d
16:06:35 [2025-04-03T16:06:35.226Z] Copying blob sha256:cbbc00bed3b437a43a0602c0eca9b5dad67c20422ad89327c49e367c932ad4b9
16:06:35 [2025-04-03T16:06:35.226Z] Copying blob sha256:de5bfb4e26416136fc6f3ca0b83d050e77e66cd5cc4817f0f5f75e65b4c52c8a
16:06:35 [2025-04-03T16:06:35.480Z] Copying blob sha256:32defb066edececeedfcc304ec5b7589d58f05644d9721985e64aa6e5b74dfe5
16:06:35 [2025-04-03T16:06:35.733Z] Copying blob sha256:d8c3ea771624f0fc712a826a0b2bc08045b53885da2977d7636e1b6beeed9ba1
16:06:35 [2025-04-03T16:06:35.987Z] Copying blob sha256:c7f3f4b13503d1c7762f40f028d4f201d521d243b9bba5b086ce17929859dd37
16:06:36 [2025-04-03T16:06:36.906Z] Copying blob sha256:8f3814b240dcfa86c380817c1afccc9bace1a0269f06b2b778d1cf8e76a7ed4e
16:06:37 [2025-04-03T16:06:37.462Z] Copying blob sha256:fa5d4ebd31c86038785c54c14674d51d073b235be09834d6adb9a1372f72c656
16:06:38 [2025-04-03T16:06:38.384Z] Copying blob sha256:2b0715bab84e25e147a8d681c5b3f3543093112cbd7c971bedb807741fe0108b
16:06:38 [2025-04-03T16:06:38.650Z] Copying blob sha256:e1b4648814d103940a247ff37840d1b3af6c6ced8d13b2187b1f4ad8f0604478
16:06:38 [2025-04-03T16:06:38.905Z] Copying blob sha256:6ad3465682007aa30c6074db45ccff30b22c6bad4783c37048f58f6f28b7b9fc
16:06:39 [2025-04-03T16:06:39.158Z] Copying blob sha256:e99ae8300c71b14ddb8eb9a65ec2fd9b8fab968c1d1b0e9f82ce3c6004123525
16:06:39 [2025-04-03T16:06:39.158Z] Copying blob sha256:d04f92a517ab9a8459141cb7a56cafcf597049d1e1ccb8a1ba3cc9118b2db5d8
16:06:39 [2025-04-03T16:06:39.713Z] Copying blob sha256:ad733936a66b34705f90b53e924b5256ab6288509bac3dc166cd49bb8c970cbe
16:06:39 [2025-04-03T16:06:39.968Z] [33m
16:06:39 [2025-04-03T16:06:39.968Z] Filesystem Size Used Avail Use% Mounted on
16:06:39 [2025-04-03T16:06:39.968Z] /dev/vdb1 40G 6.8G 34G 17% /home/jenkins/agent/workspace/test-override/cache
16:06:39 [2025-04-03T16:06:39.968Z] [39m
16:06:40 [2025-04-03T16:06:40.221Z] Copying blob sha256:56b99d43bf4af6729c7c1710e53724fa9ed39c9176eb80b36bc5df31fd2b786b
16:06:40 [2025-04-03T16:06:40.474Z] Copying blob sha256:46e0360b8a77c8bc927793da8e02df9f861d59955c3ad753eea9da849c3df1ef
16:06:41 [2025-04-03T16:06:41.031Z] Copying blob sha256:4fa49eb2dde6944a12d556b7a0de6d8a8aadf22349afe124769a38a9b7687217
16:06:42 [2025-04-03T16:06:42.387Z] Copying blob sha256:eff672627bd4b4d78fa79945bd332eee4276ac5a7e0ad0a70dafbf0140275431
16:06:44 [2025-04-03T16:06:44.290Z] Copying blob sha256:9dad063a624b62064bf25dbbc2e802e472d636056f661f2a0be73efd8a4da98b
16:06:44 [2025-04-03T16:06:44.290Z] Copying config sha256:dab13bdb9d23cce939c333fb2904ec9cfb85973dd2dca2a8b2c28b21f9529fb4
16:06:44 [2025-04-03T16:06:44.290Z] Writing manifest to image destination
16:06:50 [2025-04-03T16:06:50.807Z] [33m
16:06:50 [2025-04-03T16:06:50.807Z] Filesystem Size Used Avail Use% Mounted on
16:06:50 [2025-04-03T16:06:50.807Z] /dev/vdb1 40G 6.7G 34G 17% /home/jenkins/agent/workspace/test-override/cache
16:06:50 [2025-04-03T16:06:50.807Z] [39m
16:07:00 [2025-04-03T16:07:00.744Z] [33m
16:07:00 [2025-04-03T16:07:00.744Z] Filesystem Size Used Avail Use% Mounted on
16:07:00 [2025-04-03T16:07:00.744Z] /dev/vdb1 40G 7.2G 33G 18% /home/jenkins/agent/workspace/test-override/cache
16:07:00 [2025-04-03T16:07:00.744Z] [39m
16:07:01 [2025-04-03T16:07:01.664Z] dab13bdb9d23cce939c333fb2904ec9cfb85973dd2dca2a8b2c28b21f9529fb4
16:07:06 [2025-04-03T16:07:06.889Z] Untagged: docker.io/library/tmp-container-deploy-45465914876062:latest
16:07:06 [2025-04-03T16:07:06.889Z] Deleted: dab13bdb9d23cce939c333fb2904ec9cfb85973dd2dca2a8b2c28b21f9529fb4
16:07:06 [2025-04-03T16:07:06.889Z]
16:07:06 [2025-04-03T16:07:06.889Z] ��� Duration: 52s
16:07:10 [2025-04-03T16:07:10.143Z] [33m
16:07:10 [2025-04-03T16:07:10.143Z] Filesystem Size Used Avail Use% Mounted on
16:07:10 [2025-04-03T16:07:10.143Z] /dev/vdb1 40G 5.5G 35G 14% /home/jenkins/agent/workspace/test-override/cache
16:07:10 [2025-04-03T16:07:10.143Z] [39m
16:07:12 [2025-04-03T16:07:12.647Z] Pipeline tree: fc087277b0df06b76ee6da93c4223cb9515cf2495949a382a3d3ec8d9a7a642d
16:07:12 [2025-04-03T16:07:12.647Z] Build
16:07:12 [2025-04-03T16:07:12.647Z] root: <host>
16:07:12 [2025-04-03T16:07:12.647Z] runner: org.osbuild.fedora38 (org.osbuild.fedora38)
16:07:12 [2025-04-03T16:07:12.647Z] source-epoch: Mon Aug 1 23:42:11 2022 [1659397331]
16:07:12 [2025-04-03T16:07:12.647Z] org.osbuild.selinux: 8b080bc8440394a70a57bca856cfdc3ca3a69afc10871bd77a0d51f5ed347128 {
16:07:12 [2025-04-03T16:07:12.647Z] "file_contexts": "input://tree/etc/selinux/targeted/contexts/files/file_contexts",
16:07:12 [2025-04-03T16:07:12.647Z] "target": "tree:///"
16:07:12 [2025-04-03T16:07:12.647Z] }
16:07:12 [2025-04-03T16:07:12.647Z] Failed to open file "/sys/fs/selinux/checkreqprot": Read-only file system
16:07:12 [2025-04-03T16:07:12.647Z] setfiles: /run/osbuild/inputs/tree/etc/selinux/targeted/contexts/files/file_contexts.bin: line 1 error due to: Non-ASCII characters found
16:07:12 [2025-04-03T16:07:12.647Z] setfiles: /run/osbuild/inputs/tree/etc/selinux/targeted/contexts/files/file_contexts.homedirs.bin: line 1 error due to: Non-ASCII characters found
16:07:12 [2025-04-03T16:07:12.647Z]
16:07:12 [2025-04-03T16:07:12.647Z] ��� Duration: 0s
16:07:12 [2025-04-03T16:07:12.647Z] org.osbuild.ostree.init-fs: 1c10244b115298b1a4295b0093c9a691ca24fa1c63a3fe68ac036ef2614dfed3 {}
16:07:12 [2025-04-03T16:07:12.900Z] Failed to open file "/sys/fs/selinux/checkreqprot": Read-only file system
16:07:12 [2025-04-03T16:07:12.900Z] ostree admin init-fs --modern /run/osbuild/tree --sysroot=/run/osbuild/tree
16:07:12 [2025-04-03T16:07:12.900Z]
16:07:12 [2025-04-03T16:07:12.900Z] ��� Duration: 0s
16:07:12 [2025-04-03T16:07:12.900Z] org.osbuild.ostree.os-init: f48b90f2ae0455cb6b712ce42ac4a1ac78f9f66e071ba7c743c0fb2f54daa8af {
16:07:12 [2025-04-03T16:07:12.900Z] "osname": "fedora-coreos"
16:07:12 [2025-04-03T16:07:12.900Z] }
16:07:13 [2025-04-03T16:07:13.154Z] Failed to open file "/sys/fs/selinux/checkreqprot": Read-only file system
16:07:13 [2025-04-03T16:07:13.154Z] ostree admin os-init fedora-coreos --sysroot=/run/osbuild/tree
16:07:13 [2025-04-03T16:07:13.154Z]
16:07:13 [2025-04-03T16:07:13.154Z] ��� Duration: 0s
16:07:13 [2025-04-03T16:07:13.154Z] org.osbuild.ostree.config: 59205e92ca59c3b99fa6c38c80539fafe2ccda303bebea91509c5d6729ef036b {
16:07:13 [2025-04-03T16:07:13.154Z] "repo": "/ostree/repo",
16:07:13 [2025-04-03T16:07:13.154Z] "config": {
16:07:13 [2025-04-03T16:07:13.154Z] "sysroot": {
16:07:13 [2025-04-03T16:07:13.154Z] "readonly": true,
16:07:13 [2025-04-03T16:07:13.154Z] "bootloader": "none",
16:07:13 [2025-04-03T16:07:13.154Z] "bls-append-except-default": "grub_users=\"\"",
16:07:13 [2025-04-03T16:07:13.154Z] "bootprefix": true
16:07:13 [2025-04-03T16:07:13.154Z] }
16:07:13 [2025-04-03T16:07:13.154Z] }
16:07:13 [2025-04-03T16:07:13.154Z] }
16:07:13 [2025-04-03T16:07:13.407Z] Failed to open file "/sys/fs/selinux/checkreqprot": Read-only file system
16:07:13 [2025-04-03T16:07:13.407Z] ostree config set sysroot.bootloader none --repo=/run/osbuild/tree/ostree/repo
16:07:13 [2025-04-03T16:07:13.407Z] ostree config set sysroot.bootprefix true --repo=/run/osbuild/tree/ostree/repo
16:07:13 [2025-04-03T16:07:13.407Z] ostree config set sysroot.readonly true --repo=/run/osbuild/tree/ostree/repo
16:07:13 [2025-04-03T16:07:13.407Z] ostree config set sysroot.bls-append-except-default grub_users="" --repo=/run/osbuild/tree/ostree/repo
16:07:13 [2025-04-03T16:07:13.407Z]
16:07:13 [2025-04-03T16:07:13.407Z] ��� Duration: 0s
16:07:13 [2025-04-03T16:07:13.407Z] org.osbuild.mkdir: d5c00c3565e40b6de3588fe72f9e2cf5f9ebe8b20a70c1e39aae9cbd5472e369 {
16:07:13 [2025-04-03T16:07:13.407Z] "paths": [
16:07:13 [2025-04-03T16:07:13.407Z] {
16:07:13 [2025-04-03T16:07:13.407Z] "path": "/boot/efi",
16:07:13 [2025-04-03T16:07:13.407Z] "mode": 493
16:07:13 [2025-04-03T16:07:13.407Z] }
16:07:13 [2025-04-03T16:07:13.407Z] ]
16:07:13 [2025-04-03T16:07:13.407Z] }
16:07:13 [2025-04-03T16:07:13.660Z] Failed to open file "/sys/fs/selinux/checkreqprot": Read-only file system
16:07:13 [2025-04-03T16:07:13.660Z]
16:07:13 [2025-04-03T16:07:13.660Z] ��� Duration: 0s
16:07:13 [2025-04-03T16:07:13.660Z] org.osbuild.ignition: 40fa0498db18e1f2245e15a9a06ac68424e069b65e034517dca848569ce42931 {}
16:07:13 [2025-04-03T16:07:13.913Z] Failed to open file "/sys/fs/selinux/checkreqprot": Read-only file system
16:07:13 [2025-04-03T16:07:13.913Z]
16:07:13 [2025-04-03T16:07:13.913Z] ��� Duration: 0s
16:07:13 [2025-04-03T16:07:13.913Z] org.osbuild.ostree.deploy.container: 9a52ca0cf6ed25d586896ebdf733d73bdb6136df52c418aa1b7dd46fcf3ad728 {
16:07:13 [2025-04-03T16:07:13.913Z] "osname": "fedora-coreos",
16:07:13 [2025-04-03T16:07:13.913Z] "target_imgref": "ostree-remote-registry:fedora:quay.io/fedora/fedora-coreos:rawhide",
16:07:13 [2025-04-03T16:07:13.913Z] "mounts": [
16:07:13 [2025-04-03T16:07:13.913Z] "/boot",
16:07:13 [2025-04-03T16:07:13.913Z] "/boot/efi"
16:07:13 [2025-04-03T16:07:13.913Z] ],
16:07:13 [2025-04-03T16:07:13.913Z] "kernel_opts": [
16:07:13 [2025-04-03T16:07:13.913Z] "rw",
16:07:13 [2025-04-03T16:07:13.913Z] "$ignition_firstboot",
16:07:13 [2025-04-03T16:07:13.913Z] "mitigations=auto,nosmt"
16:07:13 [2025-04-03T16:07:13.913Z] ]
16:07:13 [2025-04-03T16:07:13.913Z] }
16:07:14 [2025-04-03T16:07:14.166Z] input/images (org.osbuild.containers): target /home/jenkins/agent/workspace/test-override/cache/osbuild/store/tmp/buildroot-tmp-_6xzbcym/inputs/images
16:07:14 [2025-04-03T16:07:14.166Z] Failed to open file "/sys/fs/selinux/checkreqprot": Read-only file system
16:07:14 [2025-04-03T16:07:14.166Z] ostree container image deploy --imgref=ostree-unverified-image:oci-archive:/tmp/tmpauy2cp3y/image --stateroot=fedora-coreos --target-imgref=ostree-remote-registry:fedora:quay.io/fedora/fedora-coreos:rawhide --karg=rw --karg=$ignition_firstboot --karg=mitigations=auto,nosmt --sysroot=/run/osbuild/tree
16:07:20 [2025-04-03T16:07:20.677Z] [33m
16:07:20 [2025-04-03T16:07:20.677Z] Filesystem Size Used Avail Use% Mounted on
16:07:20 [2025-04-03T16:07:20.677Z] /dev/vdb1 40G 6.8G 34G 17% /home/jenkins/agent/workspace/test-override/cache
16:07:20 [2025-04-03T16:07:20.677Z] [39m
16:07:30 [2025-04-03T16:07:30.589Z] [33m
16:07:30 [2025-04-03T16:07:30.589Z] Filesystem Size Used Avail Use% Mounted on
16:07:30 [2025-04-03T16:07:30.589Z] /dev/vdb1 40G 7.6G 33G 19% /home/jenkins/agent/workspace/test-override/cache
16:07:30 [2025-04-03T16:07:30.589Z] [39m
16:07:35 [2025-04-03T16:07:35.812Z] /proc/self/fd/22/usr/etc/selinux/targeted/contexts/files/file_contexts.bin: line 1 error due to: Non-ASCII characters found
16:07:35 [2025-04-03T16:07:35.812Z] /proc/self/fd/22/usr/etc/selinux/targeted/contexts/files/file_contexts.homedirs.bin: line 1 error due to: Non-ASCII characters found
16:07:41 [2025-04-03T16:07:41.044Z] [33m
16:07:41 [2025-04-03T16:07:41.044Z] Filesystem Size Used Avail Use% Mounted on
16:07:41 [2025-04-03T16:07:41.044Z] /dev/vdb1 40G 7.0G 33G 18% /home/jenkins/agent/workspace/test-override/cache
16:07:41 [2025-04-03T16:07:41.044Z] [39m
16:07:49 [2025-04-03T16:07:49.100Z] /proc/self/fd/16/usr/etc/selinux/targeted/contexts/files/file_contexts.bin: line 1 error due to: Non-ASCII characters found
16:07:49 [2025-04-03T16:07:49.100Z] /proc/self/fd/16/usr/etc/selinux/targeted/contexts/files/file_contexts.homedirs.bin: line 1 error due to: Non-ASCII characters found
16:07:49 [2025-04-03T16:07:49.100Z] /proc/self/fd/16/etc/selinux/targeted/contexts/files/file_contexts.bin: line 1 error due to: Non-ASCII characters found
16:07:49 [2025-04-03T16:07:49.100Z] /proc/self/fd/16/etc/selinux/targeted/contexts/files/file_contexts.homedirs.bin: line 1 error due to: Non-ASCII characters found
16:07:49 [2025-04-03T16:07:49.100Z] /proc/self/fd/16/etc/selinux/targeted/contexts/files/file_contexts.bin: line 1 error due to: Non-ASCII characters found
16:07:49 [2025-04-03T16:07:49.100Z] /proc/self/fd/16/etc/selinux/targeted/contexts/files/file_contexts.homedirs.bin: line 1 error due to: Non-ASCII characters found
16:07:50 [2025-04-03T16:07:50.455Z]
16:07:50 [2025-04-03T16:07:50.455Z] ��� Duration: 36s
16:07:50 [2025-04-03T16:07:50.455Z] org.osbuild.ostree.aleph: 1eeed3e6f97aec2eb6695dea4366858dd29644037551624047f74507a4322932 {
16:07:50 [2025-04-03T16:07:50.455Z] "coreos_compat": true,
16:07:50 [2025-04-03T16:07:50.455Z] "deployment": {
16:07:50 [2025-04-03T16:07:50.455Z] "default": true
16:07:50 [2025-04-03T16:07:50.455Z] }
16:07:50 [2025-04-03T16:07:50.455Z] }
16:07:50 [2025-04-03T16:07:50.455Z] Failed to open file "/sys/fs/selinux/checkreqprot": Read-only file system
16:07:50 [2025-04-03T16:07:50.455Z] [33m
16:07:50 [2025-04-03T16:07:50.455Z] Filesystem Size Used Avail Use% Mounted on
16:07:50 [2025-04-03T16:07:50.455Z] /dev/vdb1 40G 7.1G 33G 18% /home/jenkins/agent/workspace/test-override/cache
16:07:50 [2025-04-03T16:07:50.455Z] [39m
16:07:50 [2025-04-03T16:07:50.709Z] ostree container image metadata --repo=/run/osbuild/tree/ostree/repo docker://quay.io/fedora/fedora-coreos:rawhide
16:07:50 [2025-04-03T16:07:50.709Z] ostree container image metadata --repo=/run/osbuild/tree/ostree/repo docker://quay.io/fedora/fedora-coreos:rawhide --config
16:07:50 [2025-04-03T16:07:50.709Z]
16:07:50 [2025-04-03T16:07:50.709Z] ��� Duration: 0s
16:07:50 [2025-04-03T16:07:50.709Z] org.osbuild.ostree.selinux: fc087277b0df06b76ee6da93c4223cb9515cf2495949a382a3d3ec8d9a7a642d {
16:07:50 [2025-04-03T16:07:50.709Z] "deployment": {
16:07:50 [2025-04-03T16:07:50.709Z] "default": true
16:07:50 [2025-04-03T16:07:50.709Z] }
16:07:50 [2025-04-03T16:07:50.709Z] }
16:07:50 [2025-04-03T16:07:50.709Z] Failed to open file "/sys/fs/selinux/checkreqprot": Read-only file system
16:07:50 [2025-04-03T16:07:50.964Z] setfiles: /run/osbuild/tree/ostree/deploy/fedora-coreos/deploy/f820779f4991e5ee5d12ff3d709e8cfaf13db17d3de2c35460f5641fdab80160.0/etc/selinux/targeted/contexts/files/file_contexts.bin: line 1 error due to: Non-ASCII characters found
16:07:50 [2025-04-03T16:07:50.964Z] setfiles: /run/osbuild/tree/ostree/deploy/fedora-coreos/deploy/f820779f4991e5ee5d12ff3d709e8cfaf13db17d3de2c35460f5641fdab80160.0/etc/selinux/targeted/contexts/files/file_contexts.homedirs.bin: line 1 error due to: Non-ASCII characters found
16:07:50 [2025-04-03T16:07:50.964Z] setfiles: /run/osbuild/tree/ostree/deploy/fedora-coreos/deploy/f820779f4991e5ee5d12ff3d709e8cfaf13db17d3de2c35460f5641fdab80160.0/etc/selinux/targeted/contexts/files/file_contexts.bin: line 1 error due to: Non-ASCII characters found
16:07:50 [2025-04-03T16:07:50.964Z] setfiles: /run/osbuild/tree/ostree/deploy/fedora-coreos/deploy/f820779f4991e5ee5d12ff3d709e8cfaf13db17d3de2c35460f5641fdab80160.0/etc/selinux/targeted/contexts/files/file_contexts.homedirs.bin: line 1 error due to: Non-ASCII characters found
16:07:51 [2025-04-03T16:07:51.217Z] setfiles: /run/osbuild/tree/ostree/deploy/fedora-coreos/deploy/f820779f4991e5ee5d12ff3d709e8cfaf13db17d3de2c35460f5641fdab80160.0/etc/selinux/targeted/contexts/files/file_contexts.bin: line 1 error due to: Non-ASCII characters found
16:07:51 [2025-04-03T16:07:51.217Z] setfiles: /run/osbuild/tree/ostree/deploy/fedora-coreos/deploy/f820779f4991e5ee5d12ff3d709e8cfaf13db17d3de2c35460f5641fdab80160.0/etc/selinux/targeted/contexts/files/file_contexts.homedirs.bin: line 1 error due to: Non-ASCII characters found
16:07:51 [2025-04-03T16:07:51.217Z]
16:07:51 [2025-04-03T16:07:51.217Z] ��� Duration: 0s
16:07:57 [2025-04-03T16:07:57.728Z] Pipeline raw-image: 777d96aa54b10100786092b451a5d1a0b214abc8701127b114efb66b9906b8ac
16:07:57 [2025-04-03T16:07:57.728Z] Build
16:07:57 [2025-04-03T16:07:57.728Z] root: <host>
16:07:57 [2025-04-03T16:07:57.728Z] runner: org.osbuild.fedora38 (org.osbuild.fedora38)
16:07:57 [2025-04-03T16:07:57.728Z] org.osbuild.truncate: a700aaad6b960addf22fbf90ee97fa00a96527085b62197cf911e950d90b58e2 {
16:07:57 [2025-04-03T16:07:57.728Z] "filename": "disk.img",
16:07:57 [2025-04-03T16:07:57.728Z] "size": "2859466752"
16:07:57 [2025-04-03T16:07:57.728Z] }
16:07:57 [2025-04-03T16:07:57.982Z] Failed to open file "/sys/fs/selinux/checkreqprot": Read-only file system
16:07:57 [2025-04-03T16:07:57.982Z]
16:07:57 [2025-04-03T16:07:57.982Z] ��� Duration: 0s
16:07:57 [2025-04-03T16:07:57.982Z] org.osbuild.sfdisk: 00d8392809bf062e3b18d26868eebfa3ce5762594acebf8b5f7695fcb49b629d {
16:07:57 [2025-04-03T16:07:57.982Z] "uuid": "00000000-0000-4000-a000-000000000001",
16:07:57 [2025-04-03T16:07:57.982Z] "label": "gpt",
16:07:57 [2025-04-03T16:07:57.982Z] "partitions": [
16:07:57 [2025-04-03T16:07:57.982Z] {
16:07:57 [2025-04-03T16:07:57.982Z] "start": 2048,
16:07:57 [2025-04-03T16:07:57.982Z] "partnum": 1,
16:07:57 [2025-04-03T16:07:57.982Z] "size": 2048,
16:07:57 [2025-04-03T16:07:57.982Z] "type": "21686148-6449-6E6F-744E-656564454649",
16:07:57 [2025-04-03T16:07:57.982Z] "bootable": true,
16:07:57 [2025-04-03T16:07:57.982Z] "name": "BIOS-BOOT"
16:07:57 [2025-04-03T16:07:57.982Z] },
16:07:57 [2025-04-03T16:07:57.982Z] {
16:07:57 [2025-04-03T16:07:57.982Z] "start": 4096,
16:07:57 [2025-04-03T16:07:57.982Z] "partnum": 2,
16:07:57 [2025-04-03T16:07:57.982Z] "size": 260096,
16:07:57 [2025-04-03T16:07:57.982Z] "type": "C12A7328-F81F-11D2-BA4B-00A0C93EC93B",
16:07:57 [2025-04-03T16:07:57.982Z] "name": "EFI-SYSTEM"
16:07:57 [2025-04-03T16:07:57.982Z] },
16:07:57 [2025-04-03T16:07:57.982Z] {
16:07:57 [2025-04-03T16:07:57.982Z] "start": 264192,
16:07:57 [2025-04-03T16:07:57.982Z] "partnum": 3,
16:07:57 [2025-04-03T16:07:57.982Z] "size": 786432,
16:07:57 [2025-04-03T16:07:57.982Z] "type": "0FC63DAF-8483-4772-8E79-3D69D8477DE4",
16:07:57 [2025-04-03T16:07:57.982Z] "name": "boot"
16:07:57 [2025-04-03T16:07:57.982Z] },
16:07:57 [2025-04-03T16:07:57.982Z] {
16:07:57 [2025-04-03T16:07:57.982Z] "start": 1050624,
16:07:57 [2025-04-03T16:07:57.982Z] "partnum": 4,
16:07:57 [2025-04-03T16:07:57.982Z] "size": 4532224,
16:07:57 [2025-04-03T16:07:57.982Z] "type": "0FC63DAF-8483-4772-8E79-3D69D8477DE4",
16:07:57 [2025-04-03T16:07:57.982Z] "name": "root"
16:07:57 [2025-04-03T16:07:57.982Z] }
16:07:57 [2025-04-03T16:07:57.982Z] ]
16:07:57 [2025-04-03T16:07:57.982Z] }
16:07:58 [2025-04-03T16:07:58.235Z] device/device (org.osbuild.loopback): loop0 acquired (locked: False)
16:07:58 [2025-04-03T16:07:58.235Z] Failed to open file "/sys/fs/selinux/checkreqprot": Read-only file system
16:07:58 [2025-04-03T16:07:58.235Z] label: gpt
16:07:58 [2025-04-03T16:07:58.235Z] label-id: 00000000-0000-4000-a000-000000000001
16:07:58 [2025-04-03T16:07:58.235Z] /dev/loop0p1: start="2048", size="2048", type="21686148-6449-6E6F-744E-656564454649", name="BIOS-BOOT", bootable
16:07:58 [2025-04-03T16:07:58.235Z] /dev/loop0p2: start="4096", size="260096", type="C12A7328-F81F-11D2-BA4B-00A0C93EC93B", name="EFI-SYSTEM"
16:07:58 [2025-04-03T16:07:58.235Z] /dev/loop0p3: start="264192", size="786432", type="0FC63DAF-8483-4772-8E79-3D69D8477DE4", name="boot"
16:07:58 [2025-04-03T16:07:58.235Z] /dev/loop0p4: start="1050624", size="4532224", type="0FC63DAF-8483-4772-8E79-3D69D8477DE4", name="root"
16:07:58 [2025-04-03T16:07:58.489Z] {
16:07:58 [2025-04-03T16:07:58.489Z] "partitiontable": {
16:07:58 [2025-04-03T16:07:58.489Z] "label": "gpt",
16:07:58 [2025-04-03T16:07:58.489Z] "id": "00000000-0000-4000-A000-000000000001",
16:07:58 [2025-04-03T16:07:58.489Z] "device": "/dev/loop0",
16:07:58 [2025-04-03T16:07:58.489Z] "unit": "sectors",
16:07:58 [2025-04-03T16:07:58.489Z] "firstlba": 2048,
16:07:58 [2025-04-03T16:07:58.489Z] "lastlba": 5584862,
16:07:58 [2025-04-03T16:07:58.489Z] "sectorsize": 512,
16:07:58 [2025-04-03T16:07:58.489Z] "partitions": [
16:07:58 [2025-04-03T16:07:58.489Z] {
16:07:58 [2025-04-03T16:07:58.489Z] "node": "/dev/loop0p1",
16:07:58 [2025-04-03T16:07:58.489Z] "start": 2048,
16:07:58 [2025-04-03T16:07:58.489Z] "size": 2048,
16:07:58 [2025-04-03T16:07:58.489Z] "type": "21686148-6449-6E6F-744E-656564454649",
16:07:58 [2025-04-03T16:07:58.489Z] "uuid": "2EA15D79-4903-4CB5-BFF9-BCB7770696DC",
16:07:58 [2025-04-03T16:07:58.489Z] "name": "BIOS-BOOT"
16:07:58 [2025-04-03T16:07:58.489Z] },{
16:07:58 [2025-04-03T16:07:58.489Z] "node": "/dev/loop0p2",
16:07:58 [2025-04-03T16:07:58.489Z] "start": 4096,
16:07:58 [2025-04-03T16:07:58.489Z] "size": 260096,
16:07:58 [2025-04-03T16:07:58.489Z] "type": "C12A7328-F81F-11D2-BA4B-00A0C93EC93B",
16:07:58 [2025-04-03T16:07:58.489Z] "uuid": "2948ADC7-BD59-43A4-80E9-33A3E48D9634",
16:07:58 [2025-04-03T16:07:58.489Z] "name": "EFI-SYSTEM"
16:07:58 [2025-04-03T16:07:58.489Z] },{
16:07:58 [2025-04-03T16:07:58.489Z] "node": "/dev/loop0p3",
16:07:58 [2025-04-03T16:07:58.489Z] "start": 264192,
16:07:58 [2025-04-03T16:07:58.489Z] "size": 786432,
16:07:58 [2025-04-03T16:07:58.489Z] "type": "0FC63DAF-8483-4772-8E79-3D69D8477DE4",
16:07:58 [2025-04-03T16:07:58.489Z] "uuid": "406C73F8-C6AC-450A-B715-819EED72C2CD",
16:07:58 [2025-04-03T16:07:58.489Z] "name": "boot"
16:07:58 [2025-04-03T16:07:58.489Z] },{
16:07:58 [2025-04-03T16:07:58.489Z] "node": "/dev/loop0p4",
16:07:58 [2025-04-03T16:07:58.489Z] "start": 1050624,
16:07:58 [2025-04-03T16:07:58.489Z] "size": 4532224,
16:07:58 [2025-04-03T16:07:58.489Z] "type": "0FC63DAF-8483-4772-8E79-3D69D8477DE4",
16:07:58 [2025-04-03T16:07:58.489Z] "uuid": "03E4D7DC-9FD7-4BEE-B15B-DFCEDFC10DA5",
16:07:58 [2025-04-03T16:07:58.489Z] "name": "root"
16:07:58 [2025-04-03T16:07:58.489Z] }
16:07:58 [2025-04-03T16:07:58.489Z] ]
16:07:58 [2025-04-03T16:07:58.489Z] }
16:07:58 [2025-04-03T16:07:58.489Z] }
16:07:58 [2025-04-03T16:07:58.489Z]
16:07:58 [2025-04-03T16:07:58.489Z] ��� Duration: 0s
16:07:58 [2025-04-03T16:07:58.489Z] org.osbuild.mkfs.fat: d55dd8b92c126288b7a604937bcab2c6c81acec6ae8797c8a81aff93c204fac8 {
16:07:58 [2025-04-03T16:07:58.489Z] "label": "EFI-SYSTEM",
16:07:58 [2025-04-03T16:07:58.489Z] "volid": "7B7795E7"
16:07:58 [2025-04-03T16:07:58.489Z] }
16:07:58 [2025-04-03T16:07:58.489Z] device/device (org.osbuild.loopback): loop0 acquired (locked: True)
16:07:58 [2025-04-03T16:07:58.742Z] Failed to open file "/sys/fs/selinux/checkreqprot": Read-only file system
16:07:58 [2025-04-03T16:07:58.742Z] mkfs.fat 4.2 (2021-01-31)
16:07:58 [2025-04-03T16:07:58.742Z]
16:07:58 [2025-04-03T16:07:58.742Z] ��� Duration: 0s
16:07:58 [2025-04-03T16:07:58.742Z] org.osbuild.mkfs.ext4: 3967dbf1f89f5081d70763387a91f25d6b6b182c232b68e9dfd6e9b4aadd837a {
16:07:58 [2025-04-03T16:07:58.742Z] "uuid": "96d15588-3596-4b3c-adca-a2ff7279ea63",
16:07:58 [2025-04-03T16:07:58.742Z] "label": "boot",
16:07:58 [2025-04-03T16:07:58.742Z] "metadata_csum_seed": true
16:07:58 [2025-04-03T16:07:58.742Z] }
16:07:58 [2025-04-03T16:07:58.994Z] device/device (org.osbuild.loopback): loop0 acquired (locked: True)
16:07:58 [2025-04-03T16:07:58.994Z] Failed to open file "/sys/fs/selinux/checkreqprot": Read-only file system
16:07:59 [2025-04-03T16:07:59.249Z] mke2fs 1.47.1 (20-May-2024)
16:07:59 [2025-04-03T16:07:59.249Z] Discarding device blocks: 0/393216 done
16:07:59 [2025-04-03T16:07:59.249Z] Creating filesystem with 393216 1k blocks and 98304 inodes
16:07:59 [2025-04-03T16:07:59.249Z] Filesystem UUID: 96d15588-3596-4b3c-adca-a2ff7279ea63
16:07:59 [2025-04-03T16:07:59.249Z] Superblock backups stored on blocks:
16:07:59 [2025-04-03T16:07:59.249Z] 8193, 24577, 40961, 57345, 73729, 204801, 221185
16:07:59 [2025-04-03T16:07:59.249Z]
16:07:59 [2025-04-03T16:07:59.249Z] Allocating group tables: 0/48 done
16:07:59 [2025-04-03T16:07:59.249Z] Writing inode tables: 0/48 done
16:07:59 [2025-04-03T16:07:59.249Z] Creating journal (8192 blocks): done
16:07:59 [2025-04-03T16:07:59.249Z] Writing superblocks and filesystem accounting information: 0/48 done
16:07:59 [2025-04-03T16:07:59.249Z]
16:07:59 [2025-04-03T16:07:59.249Z]
16:07:59 [2025-04-03T16:07:59.249Z] ��� Duration: 0s
16:07:59 [2025-04-03T16:07:59.249Z] org.osbuild.mkfs.xfs: 6e559847729f0f100830fcdeab1841d3c86ba10294b6801166a6a19202901d34 {
16:07:59 [2025-04-03T16:07:59.249Z] "uuid": "910678ff-f77e-4a7d-8d53-86f2ac47a823",
16:07:59 [2025-04-03T16:07:59.249Z] "label": "root"
16:07:59 [2025-04-03T16:07:59.249Z] }
16:07:59 [2025-04-03T16:07:59.249Z] device/device (org.osbuild.loopback): loop0 acquired (locked: True)
16:07:59 [2025-04-03T16:07:59.502Z] Failed to open file "/sys/fs/selinux/checkreqprot": Read-only file system
16:07:59 [2025-04-03T16:07:59.502Z] meta-data=/dev/loop0 isize=512 agcount=4, agsize=141632 blks
16:07:59 [2025-04-03T16:07:59.502Z] = sectsz=512 attr=2, projid32bit=1
16:07:59 [2025-04-03T16:07:59.502Z] = crc=1 finobt=1, sparse=1, rmapbt=1
16:07:59 [2025-04-03T16:07:59.502Z] = reflink=1 bigtime=1 inobtcount=1 nrext64=1
16:07:59 [2025-04-03T16:07:59.502Z] data = bsize=4096 blocks=566528, imaxpct=25
16:07:59 [2025-04-03T16:07:59.502Z] = sunit=0 swidth=0 blks
16:07:59 [2025-04-03T16:07:59.502Z] naming =version 2 bsize=4096 ascii-ci=0, ftype=1
16:07:59 [2025-04-03T16:07:59.502Z] log =internal log bsize=4096 blocks=16384, version=2
16:07:59 [2025-04-03T16:07:59.502Z] = sectsz=512 sunit=0 blks, lazy-count=1
16:07:59 [2025-04-03T16:07:59.502Z] realtime =none extsz=4096 blocks=0, rtextents=0
16:07:59 [2025-04-03T16:07:59.502Z] Discarding blocks...Done.
16:07:59 [2025-04-03T16:07:59.502Z]
16:07:59 [2025-04-03T16:07:59.502Z] ��� Duration: 0s
16:07:59 [2025-04-03T16:07:59.502Z] org.osbuild.mkdir: b0257d8abd2b3e61521259be2e848fef83792b00eb51b4f988b9f92c5a119444 {
16:07:59 [2025-04-03T16:07:59.502Z] "paths": [
16:07:59 [2025-04-03T16:07:59.502Z] {
16:07:59 [2025-04-03T16:07:59.502Z] "path": "mount://root/boot",
16:07:59 [2025-04-03T16:07:59.502Z] "mode": 493
16:07:59 [2025-04-03T16:07:59.502Z] },
16:07:59 [2025-04-03T16:07:59.502Z] {
16:07:59 [2025-04-03T16:07:59.502Z] "path": "mount://boot/efi",
16:07:59 [2025-04-03T16:07:59.502Z] "mode": 493
16:07:59 [2025-04-03T16:07:59.502Z] }
16:07:59 [2025-04-03T16:07:59.502Z] ]
16:07:59 [2025-04-03T16:07:59.502Z] }
16:07:59 [2025-04-03T16:07:59.755Z] device/disk (org.osbuild.loopback): loop0 acquired (locked: False)
16:07:59 [2025-04-03T16:07:59.755Z] mount/root (org.osbuild.xfs): mounting /dev/loop0p4 -> /home/jenkins/agent/workspace/test-override/cache/osbuild/store/tmp/buildroot-tmp-44hm9c0w/mounts/root-mount-point
16:07:59 [2025-04-03T16:07:59.755Z] mount/boot (org.osbuild.ext4): mounting /dev/loop0p3 -> /home/jenkins/agent/workspace/test-override/cache/osbuild/store/tmp/buildroot-tmp-44hm9c0w/mounts/boot-mount-point
16:08:00 [2025-04-03T16:08:00.015Z] Failed to open file "/sys/fs/selinux/checkreqprot": Read-only file system
16:08:00 [2025-04-03T16:08:00.015Z] mount/boot (org.osbuild.ext4): umount: /home/jenkins/agent/workspace/test-override/cache/osbuild/store/tmp/buildroot-tmp-44hm9c0w/mounts/boot-mount-point unmounted
16:08:00 [2025-04-03T16:08:00.015Z] mount/root (org.osbuild.xfs): umount: /home/jenkins/agent/workspace/test-override/cache/osbuild/store/tmp/buildroot-tmp-44hm9c0w/mounts/root-mount-point unmounted
16:08:00 [2025-04-03T16:08:00.269Z]
16:08:00 [2025-04-03T16:08:00.269Z] ��� Duration: 0s
16:08:00 [2025-04-03T16:08:00.269Z] org.osbuild.selinux: 5db80cc6e6d0d003b81390bc4b80de7ea5bbc1aa4627519ce090c1e18f7fb825 {
16:08:00 [2025-04-03T16:08:00.269Z] "file_contexts": "input://tree/etc/selinux/targeted/contexts/files/file_contexts",
16:08:00 [2025-04-03T16:08:00.269Z] "target": "mount://root/"
16:08:00 [2025-04-03T16:08:00.269Z] }
16:08:00 [2025-04-03T16:08:00.269Z] device/disk (org.osbuild.loopback): loop0 acquired (locked: False)
16:08:00 [2025-04-03T16:08:00.521Z] mount/root (org.osbuild.xfs): mounting /dev/loop0p4 -> /home/jenkins/agent/workspace/test-override/cache/osbuild/store/tmp/buildroot-tmp-3qm6adps/mounts/
16:08:00 [2025-04-03T16:08:00.521Z] Failed to open file "/sys/fs/selinux/checkreqprot": Read-only file system
16:08:00 [2025-04-03T16:08:00.521Z] setfiles: /run/osbuild/inputs/tree/etc/selinux/targeted/contexts/files/file_contexts.bin: line 1 error due to: Non-ASCII characters found
16:08:00 [2025-04-03T16:08:00.773Z] setfiles: /run/osbuild/inputs/tree/etc/selinux/targeted/contexts/files/file_contexts.homedirs.bin: line 1 error due to: Non-ASCII characters found
16:08:00 [2025-04-03T16:08:00.773Z] [33m
16:08:00 [2025-04-03T16:08:00.773Z] Filesystem Size Used Avail Use% Mounted on
16:08:00 [2025-04-03T16:08:00.773Z] /dev/vdb1 40G 7.1G 33G 18% /home/jenkins/agent/workspace/test-override/cache
16:08:00 [2025-04-03T16:08:00.773Z] [39m
16:08:00 [2025-04-03T16:08:00.773Z] mount/root (org.osbuild.xfs): umount: /home/jenkins/agent/workspace/test-override/cache/osbuild/store/tmp/buildroot-tmp-3qm6adps/mounts/ unmounted
16:08:00 [2025-04-03T16:08:00.773Z]
16:08:00 [2025-04-03T16:08:00.773Z] ��� Duration: 0s
16:08:00 [2025-04-03T16:08:00.773Z] org.osbuild.selinux: 1da84fdc27debb8c6f99f8785476677d7124fe0d7b5ad193e266917903958ba0 {
16:08:00 [2025-04-03T16:08:00.773Z] "file_contexts": "input://tree/etc/selinux/targeted/contexts/files/file_contexts",
16:08:00 [2025-04-03T16:08:00.773Z] "target": "mount://root/boot/"
16:08:00 [2025-04-03T16:08:00.773Z] }
16:08:01 [2025-04-03T16:08:01.027Z] device/disk (org.osbuild.loopback): loop0 acquired (locked: False)
16:08:01 [2025-04-03T16:08:01.027Z] mount/root (org.osbuild.xfs): mounting /dev/loop0p4 -> /home/jenkins/agent/workspace/test-override/cache/osbuild/store/tmp/buildroot-tmp-tqrc6gz6/mounts/
16:08:01 [2025-04-03T16:08:01.027Z] mount/boot (org.osbuild.ext4): mounting /dev/loop0p3 -> /home/jenkins/agent/workspace/test-override/cache/osbuild/store/tmp/buildroot-tmp-tqrc6gz6/mounts/boot
16:08:01 [2025-04-03T16:08:01.279Z] Failed to open file "/sys/fs/selinux/checkreqprot": Read-only file system
16:08:01 [2025-04-03T16:08:01.279Z] setfiles: /run/osbuild/inputs/tree/etc/selinux/targeted/contexts/files/file_contexts.bin: line 1 error due to: Non-ASCII characters found
16:08:01 [2025-04-03T16:08:01.279Z] setfiles: /run/osbuild/inputs/tree/etc/selinux/targeted/contexts/files/file_contexts.homedirs.bin: line 1 error due to: Non-ASCII characters found
16:08:01 [2025-04-03T16:08:01.279Z] mount/boot (org.osbuild.ext4): umount: /home/jenkins/agent/workspace/test-override/cache/osbuild/store/tmp/buildroot-tmp-tqrc6gz6/mounts/boot unmounted
16:08:01 [2025-04-03T16:08:01.532Z] mount/root (org.osbuild.xfs): umount: /home/jenkins/agent/workspace/test-override/cache/osbuild/store/tmp/buildroot-tmp-tqrc6gz6/mounts/ unmounted
16:08:01 [2025-04-03T16:08:01.532Z]
16:08:01 [2025-04-03T16:08:01.532Z] ��� Duration: 0s
16:08:01 [2025-04-03T16:08:01.532Z] org.osbuild.copy: 9b4410b7491d8bbb99aa6eb579158a1457af1578e231267c459f0bc7a8eb1ffc {
16:08:01 [2025-04-03T16:08:01.532Z] "paths": [
16:08:01 [2025-04-03T16:08:01.532Z] {
16:08:01 [2025-04-03T16:08:01.532Z] "from": "input://tree/",
16:08:01 [2025-04-03T16:08:01.532Z] "to": "mount://root/"
16:08:01 [2025-04-03T16:08:01.532Z] }
16:08:01 [2025-04-03T16:08:01.532Z] ]
16:08:01 [2025-04-03T16:08:01.532Z] }
16:08:01 [2025-04-03T16:08:01.532Z] device/disk (org.osbuild.loopback): loop0 acquired (locked: False)
16:08:01 [2025-04-03T16:08:01.800Z] mount/root (org.osbuild.xfs): mounting /dev/loop0p4 -> /home/jenkins/agent/workspace/test-override/cache/osbuild/store/tmp/buildroot-tmp-a0q_fkw6/mounts/
16:08:01 [2025-04-03T16:08:01.800Z] mount/boot (org.osbuild.ext4): mounting /dev/loop0p3 -> /home/jenkins/agent/workspace/test-override/cache/osbuild/store/tmp/buildroot-tmp-a0q_fkw6/mounts/boot
16:08:01 [2025-04-03T16:08:01.800Z] mount/efi (org.osbuild.fat): mounting /dev/loop0p2 -> /home/jenkins/agent/workspace/test-override/cache/osbuild/store/tmp/buildroot-tmp-a0q_fkw6/mounts/boot/efi
16:08:02 [2025-04-03T16:08:02.053Z] Failed to open file "/sys/fs/selinux/checkreqprot": Read-only file system
16:08:02 [2025-04-03T16:08:02.053Z] copying '/run/osbuild/inputs/tree/.' -> '/run/osbuild/mounts/.'
16:08:11 [2025-04-03T16:08:11.963Z] [33m
16:08:11 [2025-04-03T16:08:11.963Z] Filesystem Size Used Avail Use% Mounted on
16:08:11 [2025-04-03T16:08:11.963Z] /dev/vdb1 40G 8.7G 32G 22% /home/jenkins/agent/workspace/test-override/cache
16:08:11 [2025-04-03T16:08:11.963Z] [39m
16:08:13 [2025-04-03T16:08:13.852Z] mount/efi (org.osbuild.fat): umount: /home/jenkins/agent/workspace/test-override/cache/osbuild/store/tmp/buildroot-tmp-a0q_fkw6/mounts/boot/efi unmounted
16:08:13 [2025-04-03T16:08:13.852Z] mount/boot (org.osbuild.ext4): umount: /home/jenkins/agent/workspace/test-override/cache/osbuild/store/tmp/buildroot-tmp-a0q_fkw6/mounts/boot unmounted
16:08:14 [2025-04-03T16:08:14.772Z] mount/root (org.osbuild.xfs): umount: /home/jenkins/agent/workspace/test-override/cache/osbuild/store/tmp/buildroot-tmp-a0q_fkw6/mounts/ unmounted
16:08:14 [2025-04-03T16:08:14.772Z]
16:08:14 [2025-04-03T16:08:14.772Z] ��� Duration: 13s
16:08:14 [2025-04-03T16:08:14.772Z] org.osbuild.bootupd: 15b98a3ff6530e12ee2ed92a611551ad9ff149f9892a3b5e3dd05925abfa8f15 {
16:08:14 [2025-04-03T16:08:14.772Z] "bios": {
16:08:14 [2025-04-03T16:08:14.772Z] "device": "disk"
16:08:14 [2025-04-03T16:08:14.772Z] },
16:08:14 [2025-04-03T16:08:14.772Z] "static-configs": true,
16:08:14 [2025-04-03T16:08:14.772Z] "deployment": {
16:08:14 [2025-04-03T16:08:14.772Z] "default": true
16:08:14 [2025-04-03T16:08:14.772Z] }
16:08:14 [2025-04-03T16:08:14.772Z] }
16:08:14 [2025-04-03T16:08:14.772Z] device/disk (org.osbuild.loopback): loop0 acquired (locked: False)
16:08:15 [2025-04-03T16:08:15.026Z] mount/root (org.osbuild.xfs): mounting /dev/loop0p4 -> /home/jenkins/agent/workspace/test-override/cache/osbuild/store/tmp/buildroot-tmp-iip2bvjm/mounts/
16:08:15 [2025-04-03T16:08:15.026Z] mount/boot (org.osbuild.ext4): mounting /dev/loop0p3 -> /home/jenkins/agent/workspace/test-override/cache/osbuild/store/tmp/buildroot-tmp-iip2bvjm/mounts/boot
16:08:15 [2025-04-03T16:08:15.026Z] mount/efi (org.osbuild.fat): mounting /dev/loop0p2 -> /home/jenkins/agent/workspace/test-override/cache/osbuild/store/tmp/buildroot-tmp-iip2bvjm/mounts/boot/efi
16:08:15 [2025-04-03T16:08:15.279Z] Failed to open file "/sys/fs/selinux/checkreqprot": Read-only file system
16:08:16 [2025-04-03T16:08:16.635Z] Installed 05_ignition.cfg
16:08:16 [2025-04-03T16:08:16.635Z] Installed: grub.cfg
16:08:16 [2025-04-03T16:08:16.635Z] Installed: "fedora/grub.cfg"
16:08:16 [2025-04-03T16:08:16.635Z] mount/efi (org.osbuild.fat): umount: /home/jenkins/agent/workspace/test-override/cache/osbuild/store/tmp/buildroot-tmp-iip2bvjm/mounts/boot/efi unmounted
16:08:16 [2025-04-03T16:08:16.635Z] mount/boot (org.osbuild.ext4): umount: /home/jenkins/agent/workspace/test-override/cache/osbuild/store/tmp/buildroot-tmp-iip2bvjm/mounts/boot unmounted
16:08:16 [2025-04-03T16:08:16.635Z] mount/root (org.osbuild.xfs): umount: /home/jenkins/agent/workspace/test-override/cache/osbuild/store/tmp/buildroot-tmp-iip2bvjm/mounts/ unmounted
16:08:16 [2025-04-03T16:08:16.635Z]
16:08:16 [2025-04-03T16:08:16.635Z] ��� Duration: 1s
16:08:16 [2025-04-03T16:08:16.635Z] org.osbuild.chattr: 777d96aa54b10100786092b451a5d1a0b214abc8701127b114efb66b9906b8ac {
16:08:16 [2025-04-03T16:08:16.635Z] "items": {
16:08:16 [2025-04-03T16:08:16.635Z] "mount://root/": {
16:08:16 [2025-04-03T16:08:16.635Z] "immutable": true
16:08:16 [2025-04-03T16:08:16.635Z] }
16:08:16 [2025-04-03T16:08:16.635Z] }
16:08:16 [2025-04-03T16:08:16.635Z] }
16:08:16 [2025-04-03T16:08:16.888Z] device/disk (org.osbuild.loopback): loop0 acquired (locked: False)
16:08:16 [2025-04-03T16:08:16.888Z] mount/root (org.osbuild.xfs): mounting /dev/loop0p4 -> /home/jenkins/agent/workspace/test-override/cache/osbuild/store/tmp/buildroot-tmp-_mogz4ni/mounts/
16:08:16 [2025-04-03T16:08:16.888Z] mount/ostree.deployment (org.osbuild.ostree.deployment): Deployment root at 'ostree/deploy/fedora-coreos/deploy/f820779f4991e5ee5d12ff3d709e8cfaf13db17d3de2c35460f5641fdab80160.0'
16:08:17 [2025-04-03T16:08:17.141Z] Failed to open file "/sys/fs/selinux/checkreqprot": Read-only file system
16:08:17 [2025-04-03T16:08:17.141Z] mount/ostree.deployment (org.osbuild.ostree.deployment): mounting /home/jenkins/agent/workspace/test-override/cache/osbuild/store/tmp/buildroot-tmp-_mogz4ni/mounts/ostree/deploy/fedora-coreos/deploy/f820779f4991e5ee5d12ff3d709e8cfaf13db17d3de2c35460f5641fdab80160.0 -> /home/jenkins/agent/workspace/test-override/cache/osbuild/store/tmp/buildroot-tmp-_mogz4ni/mounts
16:08:17 [2025-04-03T16:08:17.141Z] mount/ostree.deployment (org.osbuild.ostree.deployment): umount: /home/jenkins/agent/workspace/test-override/cache/osbuild/store/tmp/buildroot-tmp-_mogz4ni/mounts/boot unmounted
16:08:17 [2025-04-03T16:08:17.141Z] mount/ostree.deployment (org.osbuild.ostree.deployment): umount: /home/jenkins/agent/workspace/test-override/cache/osbuild/store/tmp/buildroot-tmp-_mogz4ni/mounts/var unmounted
16:08:17 [2025-04-03T16:08:17.141Z] mount/ostree.deployment (org.osbuild.ostree.deployment): umount: /home/jenkins/agent/workspace/test-override/cache/osbuild/store/tmp/buildroot-tmp-_mogz4ni/mounts/sysroot unmounted
16:08:17 [2025-04-03T16:08:17.141Z] mount/ostree.deployment (org.osbuild.ostree.deployment): umount: /home/jenkins/agent/workspace/test-override/cache/osbuild/store/tmp/buildroot-tmp-_mogz4ni/mounts unmounted
16:08:17 [2025-04-03T16:08:17.141Z] mount/ostree.deployment (org.osbuild.ostree.deployment): umount: /home/jenkins/agent/workspace/test-override/cache/osbuild/store/tmp/buildroot-tmp-_mogz4ni/mounts unmounted
16:08:17 [2025-04-03T16:08:17.141Z] mount/ostree.deployment (org.osbuild.ostree.deployment): umount: /home/jenkins/agent/workspace/test-override/cache/osbuild/store/tmp/buildroot-tmp-_mogz4ni/mounts unmounted
16:08:17 [2025-04-03T16:08:17.141Z] mount/root (org.osbuild.xfs): already unmounted: /home/jenkins/agent/workspace/test-override/cache/osbuild/store/tmp/buildroot-tmp-_mogz4ni/mounts/
16:08:17 [2025-04-03T16:08:17.411Z]
16:08:17 [2025-04-03T16:08:17.411Z] ��� Duration: 0s
16:08:17 [2025-04-03T16:08:17.411Z] Pipeline raw-qemu-image: 6e3fd27075707f5c37a564cb45114f955d05202ff346f901970424c8c822c7d7
16:08:17 [2025-04-03T16:08:17.411Z] Build
16:08:17 [2025-04-03T16:08:17.411Z] root: <host>
16:08:17 [2025-04-03T16:08:17.411Z] runner: org.osbuild.fedora38 (org.osbuild.fedora38)
16:08:17 [2025-04-03T16:08:17.411Z] org.osbuild.copy: b8091b96b9efe3418d3ce91a0c7858451023875c3ee26ab1f38fc84a8b3b88ec {
16:08:17 [2025-04-03T16:08:17.411Z] "paths": [
16:08:17 [2025-04-03T16:08:17.411Z] {
16:08:17 [2025-04-03T16:08:17.411Z] "from": "input://tree/disk.img",
16:08:17 [2025-04-03T16:08:17.411Z] "to": "tree:///disk.img"
16:08:17 [2025-04-03T16:08:17.411Z] }
16:08:17 [2025-04-03T16:08:17.411Z] ]
16:08:17 [2025-04-03T16:08:17.411Z] }
16:08:17 [2025-04-03T16:08:17.665Z] Failed to open file "/sys/fs/selinux/checkreqprot": Read-only file system
16:08:17 [2025-04-03T16:08:17.665Z] copying '/run/osbuild/inputs/tree/disk.img' -> '/run/osbuild/tree/disk.img'
16:08:17 [2025-04-03T16:08:17.665Z]
16:08:17 [2025-04-03T16:08:17.665Z] ��� Duration: 0s
16:08:17 [2025-04-03T16:08:17.665Z] org.osbuild.truncate: 11adc9f513f3e00440148262216f0b96485d78d63a4bf942006ef1ac3467691e {
16:08:17 [2025-04-03T16:08:17.665Z] "filename": "disk.img",
16:08:17 [2025-04-03T16:08:17.665Z] "size": "10737418240"
16:08:17 [2025-04-03T16:08:17.665Z] }
16:08:17 [2025-04-03T16:08:17.918Z] Failed to open file "/sys/fs/selinux/checkreqprot": Read-only file system
16:08:17 [2025-04-03T16:08:17.918Z]
16:08:17 [2025-04-03T16:08:17.918Z] ��� Duration: 0s
16:08:17 [2025-04-03T16:08:17.918Z] org.osbuild.coreos.platform: 6e3fd27075707f5c37a564cb45114f955d05202ff346f901970424c8c822c7d7 {
16:08:17 [2025-04-03T16:08:17.918Z] "platform": "qemu"
16:08:17 [2025-04-03T16:08:17.918Z] }
16:08:18 [2025-04-03T16:08:18.171Z] device/disk (org.osbuild.loopback): loop0 acquired (locked: False)
16:08:18 [2025-04-03T16:08:18.171Z] mount/root (org.osbuild.xfs): mounting /dev/loop0p4 -> /home/jenkins/agent/workspace/test-override/cache/osbuild/store/tmp/buildroot-tmp-dvqouyzd/mounts/
16:08:18 [2025-04-03T16:08:18.425Z] mount/ostree.deployment (org.osbuild.ostree.deployment): Deployment root at 'ostree/deploy/fedora-coreos/deploy/f820779f4991e5ee5d12ff3d709e8cfaf13db17d3de2c35460f5641fdab80160.0'
16:08:18 [2025-04-03T16:08:18.425Z] mount/boot (org.osbuild.ext4): mounting /dev/loop0p3 -> /home/jenkins/agent/workspace/test-override/cache/osbuild/store/tmp/buildroot-tmp-dvqouyzd/mounts/boot
16:08:18 [2025-04-03T16:08:18.678Z] Failed to open file "/sys/fs/selinux/checkreqprot": Read-only file system
16:08:18 [2025-04-03T16:08:18.678Z] mount/boot (org.osbuild.ext4): umount: /home/jenkins/agent/workspace/test-override/cache/osbuild/store/tmp/buildroot-tmp-dvqouyzd/mounts/boot unmounted
16:08:18 [2025-04-03T16:08:18.678Z] mount/ostree.deployment (org.osbuild.ostree.deployment): mounting /home/jenkins/agent/workspace/test-override/cache/osbuild/store/tmp/buildroot-tmp-dvqouyzd/mounts/ostree/deploy/fedora-coreos/deploy/f820779f4991e5ee5d12ff3d709e8cfaf13db17d3de2c35460f5641fdab80160.0 -> /home/jenkins/agent/workspace/test-override/cache/osbuild/store/tmp/buildroot-tmp-dvqouyzd/mounts
16:08:18 [2025-04-03T16:08:18.678Z] mount/ostree.deployment (org.osbuild.ostree.deployment): umount: /home/jenkins/agent/workspace/test-override/cache/osbuild/store/tmp/buildroot-tmp-dvqouyzd/mounts/boot unmounted
16:08:18 [2025-04-03T16:08:18.678Z] mount/ostree.deployment (org.osbuild.ostree.deployment): umount: /home/jenkins/agent/workspace/test-override/cache/osbuild/store/tmp/buildroot-tmp-dvqouyzd/mounts/var unmounted
16:08:18 [2025-04-03T16:08:18.678Z] mount/ostree.deployment (org.osbuild.ostree.deployment): umount: /home/jenkins/agent/workspace/test-override/cache/osbuild/store/tmp/buildroot-tmp-dvqouyzd/mounts/sysroot unmounted
16:08:18 [2025-04-03T16:08:18.678Z] mount/ostree.deployment (org.osbuild.ostree.deployment): umount: /home/jenkins/agent/workspace/test-override/cache/osbuild/store/tmp/buildroot-tmp-dvqouyzd/mounts unmounted
16:08:18 [2025-04-03T16:08:18.678Z] mount/ostree.deployment (org.osbuild.ostree.deployment): umount: /home/jenkins/agent/workspace/test-override/cache/osbuild/store/tmp/buildroot-tmp-dvqouyzd/mounts unmounted
16:08:18 [2025-04-03T16:08:18.678Z] mount/ostree.deployment (org.osbuild.ostree.deployment): umount: /home/jenkins/agent/workspace/test-override/cache/osbuild/store/tmp/buildroot-tmp-dvqouyzd/mounts unmounted
16:08:18 [2025-04-03T16:08:18.678Z] mount/root (org.osbuild.xfs): already unmounted: /home/jenkins/agent/workspace/test-override/cache/osbuild/store/tmp/buildroot-tmp-dvqouyzd/mounts/
16:08:18 [2025-04-03T16:08:18.678Z]
16:08:18 [2025-04-03T16:08:18.678Z] ��� Duration: 0s
16:08:18 [2025-04-03T16:08:18.678Z] Pipeline qemu: 796e7b0cdc868064716a36f813319efba5464bb60afd83c17376e8f52cee9509
16:08:18 [2025-04-03T16:08:18.678Z] Build
16:08:18 [2025-04-03T16:08:18.678Z] root: <host>
16:08:18 [2025-04-03T16:08:18.678Z] runner: org.osbuild.fedora38 (org.osbuild.fedora38)
16:08:18 [2025-04-03T16:08:18.678Z] org.osbuild.qemu: 796e7b0cdc868064716a36f813319efba5464bb60afd83c17376e8f52cee9509 {
16:08:18 [2025-04-03T16:08:18.678Z] "filename": "fedora-coreos-43.20250403.dev.0-qemu.x86_64.qcow2",
16:08:18 [2025-04-03T16:08:18.678Z] "format": {
16:08:18 [2025-04-03T16:08:18.678Z] "type": "qcow2",
16:08:18 [2025-04-03T16:08:18.678Z] "compression": false,
16:08:18 [2025-04-03T16:08:18.678Z] "compat": "1.1"
16:08:18 [2025-04-03T16:08:18.678Z] }
16:08:18 [2025-04-03T16:08:18.678Z] }
16:08:18 [2025-04-03T16:08:18.931Z] Failed to open file "/sys/fs/selinux/checkreqprot": Read-only file system
16:08:21 [2025-04-03T16:08:21.434Z] [33m
16:08:21 [2025-04-03T16:08:21.434Z] Filesystem Size Used Avail Use% Mounted on
16:08:21 [2025-04-03T16:08:21.434Z] /dev/vdb1 40G 10G 31G 25% /home/jenkins/agent/workspace/test-override/cache
16:08:21 [2025-04-03T16:08:21.434Z] [39m
16:08:22 [2025-04-03T16:08:22.355Z]
16:08:22 [2025-04-03T16:08:22.355Z] ��� Duration: 3s
16:08:22 [2025-04-03T16:08:22.355Z] manifest /tmp/osbuild-oYzu.json finished successfully
16:08:32 [2025-04-03T16:08:32.281Z] [33m
16:08:32 [2025-04-03T16:08:32.281Z] Filesystem Size Used Avail Use% Mounted on
16:08:32 [2025-04-03T16:08:32.281Z] /dev/vdb1 40G 11G 30G 27% /home/jenkins/agent/workspace/test-override/cache
16:08:32 [2025-04-03T16:08:32.281Z] [39m
16:08:32 [2025-04-03T16:08:32.281Z] oci-archive: 449be0351686951c8e3f8b4ccd63b74ced6263783d71e80227f7a0f0ebb2b4db
16:08:32 [2025-04-03T16:08:32.281Z] deployed-tree: a2b7ce38d2a7aadb73aabc15160635211e7f6be036d36855a2e801ff2aa1abe0
16:08:32 [2025-04-03T16:08:32.281Z] tree: fc087277b0df06b76ee6da93c4223cb9515cf2495949a382a3d3ec8d9a7a642d
16:08:32 [2025-04-03T16:08:32.281Z] raw-image: 777d96aa54b10100786092b451a5d1a0b214abc8701127b114efb66b9906b8ac
16:08:32 [2025-04-03T16:08:32.281Z] raw-4k-image: 30c3261beb0f4748ed9a64c43e54d5d36edda8dc68a2fec18d60ca5bb0c7cd5e
16:08:32 [2025-04-03T16:08:32.281Z] raw-aliyun-image: 1e744c1c3766cfc2058c152f619e77ebb7c7c677e0c9a07de914a198150b1967
16:08:32 [2025-04-03T16:08:32.281Z] aliyun: 3becbded6ab296dcb120db10f7419444b4da158f0a487354af04b5b239b1dd45
16:08:32 [2025-04-03T16:08:32.281Z] raw-applehv-image: 5a977d6e28c10bbd123824e018b18b8c5b73d2ed2e2188db245299ca0a759b53
16:08:32 [2025-04-03T16:08:32.281Z] applehv: 43367030a529d6442d3d7b334354f9618433ce27971ecd8a318e94c83f841c22
16:08:32 [2025-04-03T16:08:32.281Z] raw-aws-image: affcbb6ff4e3ca2f7fb3f1e156ef51bc5dd1cb18f9b8b8639b1fee0f1f964bcf
16:08:32 [2025-04-03T16:08:32.281Z] aws: 7caf4faa80d3b437f1f5f34a03219bf76434e08cc46d981305a7a16d5416c311
16:08:32 [2025-04-03T16:08:32.281Z] raw-azure-image: fd8583c4dbc2e4c4f008d2225b6795d0692c423384c76e0e4c0f5e719e5e2f0f
16:08:32 [2025-04-03T16:08:32.281Z] azure: fe92bde0b99cf7fbe6fcb0693ed3778469447a3b5f3afc3ee736c386d0aaf2d1
16:08:32 [2025-04-03T16:08:32.281Z] raw-azurestack-image: 338446bb2029f910fc4c215e027a0dab47855352ca2cce84a7044a89e5e61653
16:08:32 [2025-04-03T16:08:32.281Z] azurestack: b26ec750b2b6a8f686af1cb0ca0dd4c21fb9472f1200020e447ce41f999bff3f
16:08:32 [2025-04-03T16:08:32.281Z] raw-digitalocean-image: d6e8659941f32004666e1cd463301c24c4e3e195c18c445bd6e3b63552e2e4b5
16:08:32 [2025-04-03T16:08:32.281Z] digitalocean: 1cd5e766029ade29660a3dd21eb10b5c6295c3708102b7663da34d0b741f3610
16:08:32 [2025-04-03T16:08:32.281Z] raw-exoscale-image: a981ca277a3c1c1a1b46b8c05959921379eb2f9b4b5a6c375ee25f2fbcb6af7d
16:08:32 [2025-04-03T16:08:32.281Z] exoscale: b188950c038cb1c54aea9756010fba50be11af62f57522eca2b1a84b09f16111
16:08:32 [2025-04-03T16:08:32.281Z] raw-gcp-image: 8c8f79f750a46c21a51a843cb23e26d7324a4afcf690057a7d6a065cdb9e1c7d
16:08:32 [2025-04-03T16:08:32.281Z] raw-gcp-image-tar: 75083317e42b99062b4fcbce95d6c0271b3728d167c96af9efade0ab42225f54
16:08:32 [2025-04-03T16:08:32.281Z] gcp: b3651d5ab6a557efd5dea9d8f5a33ac7e69d161cec9e5936db13231beaf4aa67
16:08:32 [2025-04-03T16:08:32.281Z] raw-hetzner-image: 96d73df7431be5791c6bc0c8248cd260c2908607a816217ac554d93776bb844a
16:08:32 [2025-04-03T16:08:32.281Z] hetzner: 108807f4abebaedfab67305943d9e77e742f072202f60935fa878d883c1c1090
16:08:32 [2025-04-03T16:08:32.281Z] raw-hyperv-image: 4fb31f0e29c6adbdbbcc7744156c340187d0498de4cc17b21b6449b0384cac44
16:08:32 [2025-04-03T16:08:32.281Z] hyperv: d1cf8b09b1bbf33f5d9aa0abde3312953c088c63d1d35d629af33ab9f9960006
16:08:32 [2025-04-03T16:08:32.281Z] raw-ibmcloud-image: 7098ad94b3dd4ea59fd95f3c655cda974e6590b7d86bf84a703077ca04812a51
16:08:32 [2025-04-03T16:08:32.281Z] ibmcloud: e63b8b2615b9b4f8743ddc8c6e2b5b2fca93d624315aaf8013eda3808e60a709
16:08:32 [2025-04-03T16:08:32.281Z] raw-kubevirt-image: 625b6dfd441445a85e06bfb0a030ffe5ce485fde2aed13223ca754e6b0e1a456
16:08:32 [2025-04-03T16:08:32.281Z] qemu-kubevirt-image: f844172418ef5fea2c651c46da57846e0aa57244d3a7e5f841b6876ae1902a9c
16:08:32 [2025-04-03T16:08:32.281Z] kubevirt: 4b4821d3d1b34179cd4d3b1a1553044ce29eb306237000ec282684ee425bbe65
16:08:32 [2025-04-03T16:08:32.281Z] raw-openstack-image: 9e667213feeae5994e8f1b075f1c7a0f896496c1d15f53bbb54756d42f91a45b
16:08:32 [2025-04-03T16:08:32.281Z] openstack: 5f15134a88ffadd907366ec60618447db601ed6f2a0230e7e0e60901b9f0e54b
16:08:32 [2025-04-03T16:08:32.281Z] raw-metal-image: 8cf4b8a2d699a1cfc0fc3ce68fc5231598ef5c39f4a37489a4945516b49400c1
16:08:32 [2025-04-03T16:08:32.281Z] metal: 34f825e9d24c166c25688488f495d3fb1e5aa4bb364ecb94dc6fb5159a3651d6
16:08:32 [2025-04-03T16:08:32.281Z] raw-metal4k-image: 65a5b5950a112b7d3124185e8806b038cef85a825175b9a3f171dff33a82d81b
16:08:32 [2025-04-03T16:08:32.281Z] metal4k: 8f9ad3a6c8e6d95df25ec7ee97a71457fcb7337d4fb419625ec83dba4e91310d
16:08:32 [2025-04-03T16:08:32.281Z] raw-nutanix-image: d46e3bf282f7473d90a95121ec97056f6b80d1c214df8786961d261b402b6723
16:08:32 [2025-04-03T16:08:32.281Z] nutanix: cad8d6e913ba43b6f5becc49ceefe26126d2ad1a3e0a277113ada383d54050b9
16:08:32 [2025-04-03T16:08:32.281Z] raw-qemu-image: 6e3fd27075707f5c37a564cb45114f955d05202ff346f901970424c8c822c7d7
16:08:32 [2025-04-03T16:08:32.281Z] qemu: 796e7b0cdc868064716a36f813319efba5464bb60afd83c17376e8f52cee9509
16:08:32 [2025-04-03T16:08:32.281Z] raw-vultr-image: 6a4bce175f1c6053cb6bdfbaeb5a96bfaaa88991ef60bc71ec0d85ea6ad8a07d
16:08:32 [2025-04-03T16:08:32.281Z] vultr: a296a3c425ac139e664ee24d3f7942ed606b4242390582a9f6c51db289ef8a41
16:08:32 [2025-04-03T16:08:32.281Z] live: e5add5ff4ff19eb11b378eb74fdb8822cca565c9f35a3ee2155944106b361d92
16:08:32 [2025-04-03T16:08:32.281Z] + set +x
16:08:36 [2025-04-03T16:08:36.441Z] mv: failed to preserve ownership for '/home/jenkins/agent/workspace/test-override/tmp/build.qemu/tmp.Ht8tQqHELO/qemu/fedora-coreos-43.20250403.dev.0-qemu.x86_64.qcow2': Operation not permitted
16:08:36 [2025-04-03T16:08:36.441Z] mv: failed to preserve ownership for '/home/jenkins/agent/workspace/test-override/tmp/build.qemu/tmp.Ht8tQqHELO/qemu': Operation not permitted
16:08:46 [2025-04-03T16:08:46.359Z] /home/jenkins/agent/workspace/test-override/builds/43.20250403.dev.0/x86_64/meta.json wrote with version stamp 1743696525911700769
16:08:46 [2025-04-03T16:08:46.359Z] Successfully generated: fedora-coreos-43.20250403.dev.0-qemu.x86_64.qcow2
16:08:46 [2025-04-03T16:08:46.361Z] [Pipeline] }
16:08:46 [2025-04-03T16:08:46.366Z] [Pipeline] // withEnv
16:08:46 [2025-04-03T16:08:46.373Z] [Pipeline] }
16:08:46 [2025-04-03T16:08:46.388Z] [Pipeline] // stage
16:08:46 [2025-04-03T16:08:46.459Z] [Pipeline] withEnv
16:08:46 [2025-04-03T16:08:46.459Z] [Pipeline] {
16:08:46 [2025-04-03T16:08:46.463Z] [Pipeline] sh
16:08:47 [2025-04-03T16:08:47.060Z] + set -euo pipefail
16:08:47 [2025-04-03T16:08:47.061Z] ++ umask
16:08:47 [2025-04-03T16:08:47.061Z] + '[' 0022 = 0000 ']'
16:08:47 [2025-04-03T16:08:47.061Z] + uuidgen
16:08:47 [2025-04-03T16:08:47.061Z] + cut -f1 -d-
16:08:47 [2025-04-03T16:08:47.077Z] [Pipeline] }
16:08:47 [2025-04-03T16:08:47.080Z] [Pipeline] // withEnv
16:08:47 [2025-04-03T16:08:47.092Z] [Pipeline] withEnv
16:08:47 [2025-04-03T16:08:47.093Z] [Pipeline] {
16:08:47 [2025-04-03T16:08:47.099Z] [Pipeline] sh
16:08:47 [2025-04-03T16:08:47.631Z] + set -euo pipefail
16:08:47 [2025-04-03T16:08:47.631Z] ++ umask
16:08:47 [2025-04-03T16:08:47.631Z] + '[' 0022 = 0000 ']'
16:08:47 [2025-04-03T16:08:47.631Z] + cd /home/jenkins/agent/workspace/test-override
16:08:47 [2025-04-03T16:08:47.631Z] + cosa shell -- mktemp -d /home/jenkins/agent/workspace/test-override/tmp/kola-XXXXX
16:08:47 [2025-04-03T16:08:47.635Z] [Pipeline] }
16:08:47 [2025-04-03T16:08:47.637Z] [Pipeline] // withEnv
16:08:47 [2025-04-03T16:08:47.651Z] [Pipeline] parallel
16:08:47 [2025-04-03T16:08:47.651Z] [Pipeline] { (Branch: x86_64:kola)
16:08:47 [2025-04-03T16:08:47.651Z] [Pipeline] { (Branch: x86_64:kola:upgrade)
16:08:47 [2025-04-03T16:08:47.704Z] [Pipeline] withEnv
16:08:47 [2025-04-03T16:08:47.711Z] [Pipeline] {
16:08:47 [2025-04-03T16:08:47.712Z] [Pipeline] withEnv
16:08:47 [2025-04-03T16:08:47.712Z] [Pipeline] {
16:08:47 [2025-04-03T16:08:47.717Z] [Pipeline] sh
16:08:47 [2025-04-03T16:08:47.992Z] [Pipeline] sh
16:08:48 [2025-04-03T16:08:48.246Z] + set -xeuo pipefail
16:08:48 [2025-04-03T16:08:48.246Z] ++ umask
16:08:48 [2025-04-03T16:08:48.246Z] + '[' 0022 = 0000 ']'
16:08:48 [2025-04-03T16:08:48.246Z] + test -d /home/jenkins/agent/workspace/test-override/tests/kola
16:08:48 [2025-04-03T16:08:48.280Z] [Pipeline] }
16:08:48 [2025-04-03T16:08:48.285Z] [Pipeline] // withEnv
16:08:48 [2025-04-03T16:08:48.298Z] [Pipeline] withEnv
16:08:48 [2025-04-03T16:08:48.298Z] [Pipeline] {
16:08:48 [2025-04-03T16:08:48.301Z] [Pipeline] sh
16:08:48 [2025-04-03T16:08:48.531Z] + set -xeuo pipefail
16:08:48 [2025-04-03T16:08:48.531Z] ++ umask
16:08:48 [2025-04-03T16:08:48.531Z] + '[' 0022 = 0000 ']'
16:08:48 [2025-04-03T16:08:48.531Z] + cd /home/jenkins/agent/workspace/test-override
16:08:48 [2025-04-03T16:08:48.531Z] + cosa kola run-upgrade --rerun --allow-rerun-success=tags=needs-internet --build=latest --output-dir=/home/jenkins/agent/workspace/test-override/tmp/kola-iqjrr/kola-upgrade-x86_64 --on-warn-failure-exit-77 --arch=x86_64 --upgrades
16:08:48 [2025-04-03T16:08:48.531Z] kola -p qemu --build latest run-upgrade --rerun --allow-rerun-success=tags=needs-internet --on-warn-failure-exit-77 --arch=x86_64 --output-dir /home/jenkins/agent/workspace/test-override/tmp/kola-iqjrr/kola-upgrade-x86_64 --qemu-image-dir tmp/kola-qemu-cache -v --find-parent-image
16:08:48 [2025-04-03T16:08:48.531Z] 2025-04-03T16:08:48Z cli: Started logging at level INFO
16:08:48 [2025-04-03T16:08:48.531Z] 2025-04-03T16:08:48Z cli: Started logging at level INFO
16:08:48 [2025-04-03T16:08:48.844Z] + set -euo pipefail
16:08:48 [2025-04-03T16:08:48.844Z] ++ umask
16:08:48 [2025-04-03T16:08:48.844Z] + '[' 0022 = 0000 ']'
16:08:48 [2025-04-03T16:08:48.844Z] + kola list --json
16:08:48 [2025-04-03T16:08:48.844Z] + jq -r '.[].Name'
16:08:48 [2025-04-03T16:08:48.846Z] [Pipeline] }
16:08:48 [2025-04-03T16:08:48.849Z] [Pipeline] // withEnv
16:08:48 [2025-04-03T16:08:48.855Z] [Pipeline] withEnv
16:08:48 [2025-04-03T16:08:48.864Z] [Pipeline] {
16:08:48 [2025-04-03T16:08:48.867Z] [Pipeline] sh
16:08:49 [2025-04-03T16:08:49.090Z] Downloading image from https://builds.coreos.fedoraproject.org/prod/streams/rawhide/builds/43.20250402.91.0/x86_64/fedora-coreos-43.20250402.91.0-qemu.x86_64.qcow2.xz
16:08:49 [2025-04-03T16:08:49.090Z] Downloading signature from https://builds.coreos.fedoraproject.org/prod/streams/rawhide/builds/43.20250402.91.0/x86_64/fedora-coreos-43.20250402.91.0-qemu.x86_64.qcow2.xz.sig
16:08:49 [2025-04-03T16:08:49.396Z] + set -xeuo pipefail
16:08:49 [2025-04-03T16:08:49.396Z] ++ umask
16:08:49 [2025-04-03T16:08:49.396Z] + '[' 0022 = 0000 ']'
16:08:49 [2025-04-03T16:08:49.396Z] + cd /home/jenkins/agent/workspace/test-override
16:08:49 [2025-04-03T16:08:49.396Z] + cosa kola run --rerun --allow-rerun-success=tags=needs-internet --build=latest --output-dir=/home/jenkins/agent/workspace/test-override/tmp/kola-iqjrr/kola-x86_64 --on-warn-failure-exit-77 --arch=x86_64 '--tag=!reprovision' --parallel=5
16:08:49 [2025-04-03T16:08:49.396Z] kola -p qemu --build latest run --rerun --allow-rerun-success=tags=needs-internet --on-warn-failure-exit-77 --arch=x86_64 --tag=!reprovision --parallel=5 --output-dir /home/jenkins/agent/workspace/test-override/tmp/kola-iqjrr/kola-x86_64
16:08:49 [2025-04-03T16:08:49.653Z] ���� Snoozing kola test pattern "ext.config.toolbox" until Apr 07 2025
16:08:49 [2025-04-03T16:08:49.653Z] ���� https://github.com/coreos/fedora-coreos-tracker/issues/1908
16:08:49 [2025-04-03T16:08:49.906Z] === RUN coreos.ignition.symlink
16:08:49 [2025-04-03T16:08:49.906Z] === RUN ext.config.ignition.systemd-unmasking
16:08:49 [2025-04-03T16:08:49.906Z] === RUN podman.base
16:08:49 [2025-04-03T16:08:49.906Z] === RUN coreos.auth.verify
16:08:49 [2025-04-03T16:08:49.906Z] === RUN ext.config.gshadow
16:08:49 [2025-04-03T16:08:49.906Z] === RUN ext.config.butane.grub-users
16:08:49 [2025-04-03T16:08:49.906Z] === RUN ext.config.reboot
16:08:49 [2025-04-03T16:08:49.906Z] === RUN coreos.ignition.sethostname
16:08:49 [2025-04-03T16:08:49.906Z] === RUN fcos.network.listeners
16:08:49 [2025-04-03T16:08:49.906Z] === RUN ext.config.networking.prefer-ignition-networking
16:08:49 [2025-04-03T16:08:49.906Z] === RUN ext.config.ignition.systemd-enable-units
16:08:49 [2025-04-03T16:08:49.906Z] === RUN ext.config.networking.mtu-on-bond-kargs
16:08:49 [2025-04-03T16:08:49.906Z] === RUN ext.config.containers.quadlet
16:08:49 [2025-04-03T16:08:49.906Z] === RUN ext.config.swap.zram-generator
16:08:49 [2025-04-03T16:08:49.906Z] === RUN rpmostree.status
16:08:49 [2025-04-03T16:08:49.906Z] === RUN ext.config.ntp.timesyncd.dhcp-propagation
16:08:49 [2025-04-03T16:08:49.906Z] === RUN coreos.unique.boot.ignition.failure
16:08:49 [2025-04-03T16:08:49.906Z] === RUN basic.uefi
16:08:49 [2025-04-03T16:08:49.906Z] === RUN coreos.ignition.failure
16:08:49 [2025-04-03T16:08:49.906Z] === RUN ext.config.disks.lvmdevices
16:08:49 [2025-04-03T16:08:49.906Z] === RUN ext.config.rpm-ostree-countme
16:08:49 [2025-04-03T16:08:49.906Z] === RUN ostree.unlock
16:08:49 [2025-04-03T16:08:49.906Z] === RUN ext.config.networking.ifname-karg.udev-rule-firstboot-propagation
16:08:49 [2025-04-03T16:08:49.906Z] === RUN ostree.remote
16:08:49 [2025-04-03T16:08:49.906Z] === RUN coreos.ignition.once
16:08:49 [2025-04-03T16:08:49.906Z] === RUN ext.config.ignition.stable-boot
16:08:49 [2025-04-03T16:08:49.906Z] === RUN fcos.filesystem
16:08:49 [2025-04-03T16:08:49.906Z] === RUN coreos.ignition.groups
16:08:49 [2025-04-03T16:08:49.906Z] === RUN ext.config.ssh.custom-host-key-permissions
16:08:49 [2025-04-03T16:08:49.906Z] === RUN rhcos.selinux.boolean.persist
16:08:49 [2025-04-03T16:08:49.906Z] === RUN ext.config.networking.force-persist-ip
16:08:49 [2025-04-03T16:08:49.906Z] === RUN podman.workflow
16:08:49 [2025-04-03T16:08:49.906Z] === RUN ext.config.clhm.ignition-warnings
16:08:49 [2025-04-03T16:08:49.906Z] === RUN ostree.hotfix
16:08:49 [2025-04-03T16:08:49.906Z] === RUN ext.config.var-mount.simple
16:08:49 [2025-04-03T16:08:49.906Z] === RUN coreos.selinux.boolean
16:08:49 [2025-04-03T16:08:49.906Z] === RUN multipath.day2
16:08:49 [2025-04-03T16:08:49.906Z] === RUN ext.config.ignition.systemd-disable
16:08:49 [2025-04-03T16:08:49.906Z] === RUN ext.config.var-mount.scsi-id
16:08:49 [2025-04-03T16:08:49.906Z] === RUN ext.config.ignition.delete-config
16:08:49 [2025-04-03T16:08:49.906Z] === RUN ext.config.podman.rootless-systemd
16:08:49 [2025-04-03T16:08:49.906Z] === RUN ext.config.var-mount.luks
16:08:49 [2025-04-03T16:08:49.906Z] === RUN rootfs.uuid
16:08:49 [2025-04-03T16:08:49.906Z] === RUN basic
16:08:49 [2025-04-03T16:08:49.906Z] === RUN coreos.ignition.instantiated.enable-unit
16:08:49 [2025-04-03T16:08:49.906Z] === RUN ext.config.networking.mtu-on-bond-ignition
16:08:49 [2025-04-03T16:08:49.906Z] === RUN ext.config.networking.team-dhcp-via-ignition
16:08:49 [2025-04-03T16:08:49.906Z] === RUN rpmostree.upgrade-rollback
16:08:49 [2025-04-03T16:08:49.906Z] === RUN ext.config.networking.hostname.fallback-hostname
16:08:49 [2025-04-03T16:08:49.906Z] === RUN fcos.users.shells
16:08:49 [2025-04-03T16:08:49.906Z] === RUN coreos.ignition.mount.disks
16:08:49 [2025-04-03T16:08:49.906Z] === RUN podman.network-single
16:08:49 [2025-04-03T16:08:49.906Z] === RUN ext.config.networking.bridge-static-via-kargs
16:08:49 [2025-04-03T16:08:49.906Z] === RUN ext.config.kdump.crash
16:08:49 [2025-04-03T16:08:49.906Z] === RUN ext.config.boot.bootupd-validate
16:08:49 [2025-04-03T16:08:49.906Z] === RUN ext.config.extensions.package
16:08:49 [2025-04-03T16:08:49.906Z] === RUN ext.config.selinux.enforcing
16:08:49 [2025-04-03T16:08:49.907Z] === RUN ext.config.networking.no-default-initramfs-net-propagation.bootif
16:08:49 [2025-04-03T16:08:49.907Z] === RUN coreos.misc.disk.varlibcontainers
16:08:49 [2025-04-03T16:08:49.907Z] === RUN ext.config.networking.kargs-rd-net
16:08:49 [2025-04-03T16:08:49.907Z] === RUN coreos.ignition.v2.users
16:08:49 [2025-04-03T16:08:49.907Z] === RUN ext.config.networking.no-persist-ip
16:08:49 [2025-04-03T16:08:49.907Z] === RUN ext.config.boot.grub2-install
16:08:49 [2025-04-03T16:08:49.907Z] === RUN multipath.partition
16:08:49 [2025-04-03T16:08:49.907Z] === RUN ext.config.networking.nmstate.policy
16:08:49 [2025-04-03T16:08:49.907Z] === RUN coreos.unique.boot.failure
16:08:49 [2025-04-03T16:08:49.907Z] === RUN non-exclusive-test-bucket-0
16:08:49 [2025-04-03T16:08:49.907Z] === RUN ext.config.firewall.iptables-legacy
16:08:49 [2025-04-03T16:08:49.907Z] === RUN coreos.ignition.mount.partitions
16:08:49 [2025-04-03T16:08:49.907Z] === RUN ext.config.networking.nameserver
16:08:49 [2025-04-03T16:08:49.907Z] === RUN ext.config.ntp.chrony.dhcp-propagation
16:08:49 [2025-04-03T16:08:49.907Z] === RUN ext.config.systemd.condition-needs-update
16:08:49 [2025-04-03T16:08:49.907Z] === RUN multipath.day1
16:08:49 [2025-04-03T16:08:49.907Z] === RUN ext.config.systemd.network-online
16:08:49 [2025-04-03T16:08:49.907Z] === RUN ext.config.ignition.remote
16:08:49 [2025-04-03T16:08:49.907Z] === RUN basic.nvme
16:08:49 [2025-04-03T16:08:49.907Z] === RUN ext.config.ignition.resource.remote
16:08:49 [2025-04-03T16:08:49.907Z] === RUN ext.config.ignition.kargs
16:08:49 [2025-04-03T16:08:49.907Z] === RUN kdump.crash.ssh
16:08:49 [2025-04-03T16:08:49.907Z] === RUN ext.config.networking.nmstate.state
16:08:49 [2025-04-03T16:08:49.907Z] === RUN ext.config.docker.basic
16:08:49 [2025-04-03T16:08:49.907Z] === RUN rpmostree.install-uninstall
16:08:49 [2025-04-03T16:08:49.907Z] === RUN basic.uefi-secure
16:08:49 [2025-04-03T16:08:49.907Z] === RUN ext.config.networking.rd-net-timeout-carrier
16:08:49 [2025-04-03T16:08:49.907Z] === RUN ext.config.networking.ifname-karg.everyboot-systemd-link-file
16:08:49 [2025-04-03T16:08:49.907Z] mke2fs 1.47.1 (20-May-2024)
16:08:50 [2025-04-03T16:08:50.011Z] Read disk 61.9 MiB/714.8 MiB (8%)
16:08:50 [2025-04-03T16:08:50.930Z] Read disk 111.4 MiB/714.8 MiB (15%)
16:08:52 [2025-04-03T16:08:52.284Z] Read disk 132.3 MiB/714.8 MiB (18%)
16:08:53 [2025-04-03T16:08:53.202Z] Read disk 151.3 MiB/714.8 MiB (21%)
16:08:54 [2025-04-03T16:08:54.120Z] Read disk 187.1 MiB/714.8 MiB (26%)
16:08:55 [2025-04-03T16:08:55.079Z] Read disk 232.0 MiB/714.8 MiB (32%)
16:08:56 [2025-04-03T16:08:56.009Z] Read disk 252.7 MiB/714.8 MiB (35%)
16:08:56 [2025-04-03T16:08:56.929Z] Read disk 274.6 MiB/714.8 MiB (38%)
16:08:58 [2025-04-03T16:08:58.286Z] Read disk 294.3 MiB/714.8 MiB (41%)
16:08:59 [2025-04-03T16:08:59.214Z] Read disk 332.5 MiB/714.8 MiB (46%)
16:09:00 [2025-04-03T16:09:00.136Z] Read disk 361.3 MiB/714.8 MiB (50%)
16:09:01 [2025-04-03T16:09:01.059Z] Read disk 381.1 MiB/714.8 MiB (53%)
16:09:01 [2025-04-03T16:09:01.978Z] Read disk 428.7 MiB/714.8 MiB (59%)
16:09:03 [2025-04-03T16:09:03.335Z] Read disk 481.2 MiB/714.8 MiB (67%)
16:09:04 [2025-04-03T16:09:04.255Z] Read disk 532.2 MiB/714.8 MiB (74%)
16:09:04 [2025-04-03T16:09:04.719Z] --- [32mPASS[0m: coreos.unique.boot.failure (12.65s)
16:09:05 [2025-04-03T16:09:05.174Z] Read disk 568.6 MiB/714.8 MiB (79%)
16:09:06 [2025-04-03T16:09:06.092Z] Read disk 607.4 MiB/714.8 MiB (84%)
16:09:07 [2025-04-03T16:09:07.011Z] Read disk 642.3 MiB/714.8 MiB (89%)
16:09:08 [2025-04-03T16:09:08.364Z] Read disk 662.4 MiB/714.8 MiB (92%)
16:09:09 [2025-04-03T16:09:09.283Z] Read disk 682.2 MiB/714.8 MiB (95%)
16:09:10 [2025-04-03T16:09:10.206Z] Read disk 701.1 MiB/714.8 MiB (98%)
16:09:10 [2025-04-03T16:09:10.763Z] Read disk 714.8 MiB/714.8 MiB (100%)
16:09:10 [2025-04-03T16:09:10.763Z] Read disk 714.8 MiB/714.8 MiB (100%)
16:09:10 [2025-04-03T16:09:10.763Z] Read disk 714.8 MiB/714.8 MiB (100%)
16:09:10 [2025-04-03T16:09:10.763Z] gpg: Signature made Wed Apr 2 13:01:41 2025 UTC
16:09:10 [2025-04-03T16:09:10.763Z] gpg: using RSA key C6E7F081CF80E13146676E88829B606631645531
16:09:10 [2025-04-03T16:09:10.763Z] gpg: Good signature from "Fedora (43) <fedora-43-primary@fedoraproject.org>" [ultimate]
16:09:11 [2025-04-03T16:09:11.319Z] tmp/kola-qemu-cache/fedora-coreos-43.20250402.91.0-qemu.x86_64.qcow2
16:09:11 [2025-04-03T16:09:11.319Z] ���� Snoozing kola test pattern "ext.config.toolbox" until Apr 07 2025
16:09:11 [2025-04-03T16:09:11.319Z] ���� https://github.com/coreos/fedora-coreos-tracker/issues/1908
16:09:11 [2025-04-03T16:09:11.319Z] === RUN fcos.upgrade.basic
16:09:14 [2025-04-03T16:09:14.638Z] === RUN basic/ReadOnly
16:09:14 [2025-04-03T16:09:14.638Z] === RUN basic/Useradd
16:09:14 [2025-04-03T16:09:14.638Z] === RUN basic/MachineID
16:09:14 [2025-04-03T16:09:14.638Z] === RUN basic/FCOSGrowpart
16:09:14 [2025-04-03T16:09:14.638Z] === RUN basic/PortSSH
16:09:14 [2025-04-03T16:09:14.638Z] === RUN basic/DbusPerms
16:09:14 [2025-04-03T16:09:14.638Z] === RUN basic/ServicesActive
16:09:18 [2025-04-03T16:09:18.792Z] --- [32mPASS[0m: basic (28.31s)
16:09:18 [2025-04-03T16:09:18.792Z] --- [32mPASS[0m: basic/ReadOnly (0.11s)
16:09:18 [2025-04-03T16:09:18.792Z] --- [32mPASS[0m: basic/Useradd (0.19s)
16:09:18 [2025-04-03T16:09:18.792Z] --- [32mPASS[0m: basic/MachineID (0.11s)
16:09:18 [2025-04-03T16:09:18.792Z] --- [32mPASS[0m: basic/FCOSGrowpart (0.16s)
16:09:18 [2025-04-03T16:09:18.792Z] --- [32mPASS[0m: basic/PortSSH (0.12s)
16:09:18 [2025-04-03T16:09:18.792Z] --- [32mPASS[0m: basic/DbusPerms (0.34s)
16:09:18 [2025-04-03T16:09:18.792Z] --- [32mPASS[0m: basic/ServicesActive (0.13s)
16:09:26 [2025-04-03T16:09:26.871Z] --- [32mPASS[0m: coreos.ignition.symlink (36.21s)
16:09:27 [2025-04-03T16:09:27.801Z] --- [32mPASS[0m: ext.config.ignition.resource.remote (37.92s)
16:09:30 [2025-04-03T16:09:30.302Z] --- [32mPASS[0m: ext.config.boot.bootupd-validate (40.09s)
16:09:40 [2025-04-03T16:09:40.226Z] --- [32mPASS[0m: coreos.ignition.v2.users (36.63s)
16:09:49 [2025-04-03T16:09:49.935Z] === RUN fcos.upgrade.basic/setup
16:09:50 [2025-04-03T16:09:50.855Z] === RUN fcos.upgrade.basic/upgrade-from-previous
16:10:12 [2025-04-03T16:10:12.209Z] --- [32mPASS[0m: ext.config.boot.grub2-install (39.41s)
16:10:14 [2025-04-03T16:10:14.709Z] --- [32mPASS[0m: ext.config.networking.no-persist-ip (44.84s)
16:10:21 [2025-04-03T16:10:21.243Z] --- [32mPASS[0m: ext.config.networking.no-default-initramfs-net-propagation.bootif (41.44s)
16:10:33 [2025-04-03T16:10:33.396Z] --- [32mPASS[0m: multipath.partition (67.26s)
16:10:46 [2025-04-03T16:10:46.987Z] === RUN fcos.upgrade.basic/upgrade-from-current
16:10:51 [2025-04-03T16:10:51.421Z] --- [32mPASS[0m: ext.config.networking.kargs-rd-net (41.32s)
16:10:56 [2025-04-03T16:10:56.645Z] --- [32mPASS[0m: fcos.users.shells (35.92s)
16:11:14 [2025-04-03T16:11:14.657Z] --- [32mPASS[0m: coreos.misc.disk.varlibcontainers (58.66s)
16:11:14 [2025-04-03T16:11:14.657Z] cluster.go:151: Created symlink '/etc/systemd/system/var-lib-containers.mount.wants/systemd-mkfs@dev-disk-by-id-virtio-disk1.service' ��� '/etc/systemd/system/systemd-mkfs@dev-disk-by-id-virtio-disk1.service'.
16:11:14 [2025-04-03T16:11:14.657Z] cluster.go:151: Created symlink '/etc/systemd/system/local-fs.target.wants/var-lib-containers.mount' ��� '/etc/systemd/system/var-lib-containers.mount'.
16:11:15 [2025-04-03T16:11:15.215Z] --- [32mPASS[0m: ext.config.networking.nmstate.policy (116.99s)
16:11:25 [2025-04-03T16:11:25.602Z] --- [32mPASS[0m: fcos.upgrade.basic (133.98s)
16:11:25 [2025-04-03T16:11:25.602Z] --- [32mPASS[0m: fcos.upgrade.basic/setup (5.57s)
16:11:25 [2025-04-03T16:11:25.602Z] --- [32mPASS[0m: fcos.upgrade.basic/upgrade-from-previous (53.78s)
16:11:25 [2025-04-03T16:11:25.602Z] --- [32mPASS[0m: fcos.upgrade.basic/upgrade-from-current (36.84s)
16:11:25 [2025-04-03T16:11:25.602Z] PASS, output in /home/jenkins/agent/workspace/test-override/tmp/kola-iqjrr/kola-upgrade-x86_64
16:11:25 [2025-04-03T16:11:25.605Z] [Pipeline] }
16:11:25 [2025-04-03T16:11:25.611Z] [Pipeline] // withEnv
16:11:25 [2025-04-03T16:11:25.616Z] [Pipeline] }
16:11:30 [2025-04-03T16:11:30.023Z] --- [32mPASS[0m: ext.config.networking.bridge-static-via-kargs (41.18s)
16:12:08 [2025-04-03T16:12:08.658Z] === RUN rootfs.uuid/RandomUUID
16:12:08 [2025-04-03T16:12:08.658Z] --- [32mPASS[0m: rootfs.uuid (37.15s)
16:12:08 [2025-04-03T16:12:08.658Z] --- [32mPASS[0m: rootfs.uuid/RandomUUID (0.15s)
16:12:10 [2025-04-03T16:12:10.014Z] --- [32mPASS[0m: coreos.ignition.mount.disks (54.84s)
16:12:14 [2025-04-03T16:12:14.162Z] --- [32mPASS[0m: ext.config.networking.ifname-karg.udev-rule-firstboot-propagation (59.97s)
16:12:36 [2025-04-03T16:12:36.043Z] --- [32mPASS[0m: ext.config.kdump.crash (121.10s)
16:12:48 [2025-04-03T16:12:48.180Z] === RUN ostree.unlock/unlock
16:12:48 [2025-04-03T16:12:48.180Z] === RUN ostree.unlock/install
16:12:48 [2025-04-03T16:12:48.180Z] === RUN ostree.unlock/uninstall
16:12:48 [2025-04-03T16:12:48.180Z] --- [32mPASS[0m: ext.config.networking.mtu-on-bond-kargs (41.00s)
16:12:48 [2025-04-03T16:12:48.180Z] === RUN ostree.unlock/discard
16:13:10 [2025-04-03T16:13:10.039Z] --- [32mPASS[0m: ostree.unlock (56.32s)
16:13:10 [2025-04-03T16:13:10.039Z] --- [32mPASS[0m: ostree.unlock/unlock (0.62s)
16:13:10 [2025-04-03T16:13:10.039Z] --- [32mPASS[0m: ostree.unlock/install (0.63s)
16:13:10 [2025-04-03T16:13:10.039Z] --- [32mPASS[0m: ostree.unlock/uninstall (0.45s)
16:13:10 [2025-04-03T16:13:10.039Z] --- [32mPASS[0m: ostree.unlock/discard (18.43s)
16:13:28 [2025-04-03T16:13:28.045Z] --- [32mPASS[0m: ext.config.rpm-ostree-countme (38.59s)
16:13:30 [2025-04-03T16:13:30.556Z] --- [32mPASS[0m: ext.config.var-mount.luks (80.39s)
16:13:48 [2025-04-03T16:13:48.568Z] --- [32mPASS[0m: ext.config.podman.rootless-systemd (71.72s)
16:13:56 [2025-04-03T16:13:56.627Z] --- [32mPASS[0m: podman.network-single (179.70s)
16:14:04 [2025-04-03T16:14:04.686Z] --- [32mPASS[0m: coreos.ignition.failure (17.73s)
16:14:14 [2025-04-03T16:14:14.609Z] --- [32mPASS[0m: ext.config.var-mount.scsi-id (44.07s)
16:14:26 [2025-04-03T16:14:26.761Z] --- [32mPASS[0m: ext.config.disks.lvmdevices (58.26s)
16:14:30 [2025-04-03T16:14:30.921Z] === RUN basic.uefi/FCOSGrowpart
16:14:30 [2025-04-03T16:14:30.921Z] === RUN basic.uefi/PortSSH
16:14:30 [2025-04-03T16:14:30.921Z] === RUN basic.uefi/DbusPerms
16:14:30 [2025-04-03T16:14:30.921Z] === RUN basic.uefi/ServicesActive
16:14:31 [2025-04-03T16:14:31.174Z] === RUN basic.uefi/ReadOnly
16:14:31 [2025-04-03T16:14:31.174Z] === RUN basic.uefi/Useradd
16:14:31 [2025-04-03T16:14:31.428Z] === RUN basic.uefi/MachineID
16:14:35 [2025-04-03T16:14:35.577Z] --- [32mPASS[0m: basic.uefi (38.69s)
16:14:35 [2025-04-03T16:14:35.577Z] --- [32mPASS[0m: basic.uefi/FCOSGrowpart (0.15s)
16:14:35 [2025-04-03T16:14:35.577Z] --- [32mPASS[0m: basic.uefi/PortSSH (0.12s)
16:14:35 [2025-04-03T16:14:35.577Z] --- [32mPASS[0m: basic.uefi/DbusPerms (0.34s)
16:14:35 [2025-04-03T16:14:35.577Z] --- [32mPASS[0m: basic.uefi/ServicesActive (0.12s)
16:14:35 [2025-04-03T16:14:35.577Z] --- [32mPASS[0m: basic.uefi/ReadOnly (0.11s)
16:14:35 [2025-04-03T16:14:35.577Z] --- [32mPASS[0m: basic.uefi/Useradd (0.20s)
16:14:35 [2025-04-03T16:14:35.577Z] --- [32mPASS[0m: basic.uefi/MachineID (0.12s)
16:14:43 [2025-04-03T16:14:43.635Z] --- [32mPASS[0m: ext.config.ignition.systemd-disable (38.55s)
16:14:43 [2025-04-03T16:14:43.635Z] --- [32mPASS[0m: ext.config.ignition.delete-config (93.89s)
16:14:47 [2025-04-03T16:14:47.793Z] === RUN rpmostree.install-uninstall/install
16:14:51 [2025-04-03T16:14:51.056Z] --- [32mPASS[0m: coreos.unique.boot.ignition.failure (15.95s)
16:15:37 [2025-04-03T16:15:37.635Z] === RUN rpmostree.install-uninstall/uninstall
16:15:37 [2025-04-03T16:15:37.635Z] --- [32mPASS[0m: coreos.selinux.boolean (54.06s)
16:15:38 [2025-04-03T16:15:38.192Z] --- [32mPASS[0m: multipath.day2 (73.48s)
16:15:48 [2025-04-03T16:15:48.118Z] --- [32mPASS[0m: ext.config.var-mount.simple (57.23s)
16:16:02 [2025-04-03T16:16:02.932Z] --- [32mPASS[0m: ext.config.ntp.timesyncd.dhcp-propagation (77.11s)
16:16:10 [2025-04-03T16:16:10.990Z] === RUN ostree.hotfix/unlock
16:16:14 [2025-04-03T16:16:14.238Z] --- [32mPASS[0m: rpmostree.status (37.18s)
16:16:17 [2025-04-03T16:16:17.487Z] --- [32mPASS[0m: rpmostree.install-uninstall (122.56s)
16:16:17 [2025-04-03T16:16:17.487Z] --- [32mPASS[0m: rpmostree.install-uninstall/install (47.17s)
16:16:17 [2025-04-03T16:16:17.487Z] --- [32mPASS[0m: rpmostree.install-uninstall/uninstall (39.21s)
16:16:25 [2025-04-03T16:16:25.545Z] === RUN ostree.hotfix/install
16:16:25 [2025-04-03T16:16:25.545Z] --- [32mPASS[0m: ext.config.swap.zram-generator (37.55s)
16:16:26 [2025-04-03T16:16:26.465Z] === RUN ostree.hotfix/uninstall
16:16:27 [2025-04-03T16:16:27.022Z] === RUN ostree.hotfix/persist
16:16:39 [2025-04-03T16:16:39.160Z] --- [32mPASS[0m: ext.config.clhm.ignition-warnings (38.52s)
16:16:45 [2025-04-03T16:16:45.674Z] === RUN ostree.hotfix/rollback
16:16:53 [2025-04-03T16:16:53.730Z] --- [32mPASS[0m: ext.config.containers.quadlet (38.67s)
16:16:58 [2025-04-03T16:16:58.953Z] === RUN podman.workflow/run
16:17:08 [2025-04-03T16:17:08.868Z] --- [32mPASS[0m: ostree.hotfix (90.81s)
16:17:08 [2025-04-03T16:17:08.868Z] --- [32mPASS[0m: ostree.hotfix/unlock (14.41s)
16:17:08 [2025-04-03T16:17:08.868Z] --- [32mPASS[0m: ostree.hotfix/install (0.56s)
16:17:08 [2025-04-03T16:17:08.868Z] --- [32mPASS[0m: ostree.hotfix/uninstall (0.43s)
16:17:08 [2025-04-03T16:17:08.868Z] --- [32mPASS[0m: ostree.hotfix/persist (18.72s)
16:17:08 [2025-04-03T16:17:08.868Z] --- [32mPASS[0m: ostree.hotfix/rollback (19.60s)
16:17:17 [2025-04-03T16:17:17.367Z] --- [32mPASS[0m: ext.config.networking.ifname-karg.everyboot-systemd-link-file (59.80s)
16:17:39 [2025-04-03T16:17:39.231Z] --- [32mPASS[0m: ext.config.networking.rd-net-timeout-carrier (58.40s)
16:17:42 [2025-04-03T16:17:42.481Z] --- [32mPASS[0m: ext.config.networking.force-persist-ip (33.49s)
16:17:52 [2025-04-03T16:17:52.401Z] === RUN basic.uefi-secure/MachineID
16:17:52 [2025-04-03T16:17:52.401Z] === RUN basic.uefi-secure/FCOSGrowpart
16:17:52 [2025-04-03T16:17:52.401Z] === RUN basic.uefi-secure/PortSSH
16:17:52 [2025-04-03T16:17:52.401Z] === RUN basic.uefi-secure/DbusPerms
16:17:52 [2025-04-03T16:17:52.401Z] === RUN basic.uefi-secure/ServicesActive
16:17:52 [2025-04-03T16:17:52.401Z] === RUN basic.uefi-secure/ReadOnly
16:17:52 [2025-04-03T16:17:52.401Z] === RUN basic.uefi-secure/Useradd
16:17:56 [2025-04-03T16:17:56.568Z] --- [32mPASS[0m: basic.uefi-secure (39.04s)
16:17:56 [2025-04-03T16:17:56.568Z] --- [32mPASS[0m: basic.uefi-secure/MachineID (0.11s)
16:17:56 [2025-04-03T16:17:56.568Z] --- [32mPASS[0m: basic.uefi-secure/FCOSGrowpart (0.15s)
16:17:56 [2025-04-03T16:17:56.568Z] --- [32mPASS[0m: basic.uefi-secure/PortSSH (0.12s)
16:17:56 [2025-04-03T16:17:56.568Z] --- [32mPASS[0m: basic.uefi-secure/DbusPerms (0.35s)
16:17:56 [2025-04-03T16:17:56.568Z] --- [32mPASS[0m: basic.uefi-secure/ServicesActive (0.12s)
16:17:56 [2025-04-03T16:17:56.568Z] --- [32mPASS[0m: basic.uefi-secure/ReadOnly (0.11s)
16:17:56 [2025-04-03T16:17:56.568Z] --- [32mPASS[0m: basic.uefi-secure/Useradd (0.19s)
16:18:11 [2025-04-03T16:18:11.388Z] === RUN basic.nvme/Useradd
16:18:11 [2025-04-03T16:18:11.388Z] === RUN basic.nvme/MachineID
16:18:11 [2025-04-03T16:18:11.388Z] === RUN basic.nvme/FCOSGrowpart
16:18:11 [2025-04-03T16:18:11.641Z] === RUN basic.nvme/PortSSH
16:18:11 [2025-04-03T16:18:11.641Z] === RUN basic.nvme/DbusPerms
16:18:11 [2025-04-03T16:18:11.894Z] === RUN basic.nvme/ServicesActive
16:18:12 [2025-04-03T16:18:12.147Z] === RUN basic.nvme/ReadOnly
16:18:16 [2025-04-03T16:18:16.298Z] --- [32mPASS[0m: basic.nvme (37.87s)
16:18:16 [2025-04-03T16:18:16.298Z] --- [32mPASS[0m: basic.nvme/Useradd (0.20s)
16:18:16 [2025-04-03T16:18:16.298Z] --- [32mPASS[0m: basic.nvme/MachineID (0.11s)
16:18:16 [2025-04-03T16:18:16.298Z] --- [32mPASS[0m: basic.nvme/FCOSGrowpart (0.15s)
16:18:16 [2025-04-03T16:18:16.298Z] --- [32mPASS[0m: basic.nvme/PortSSH (0.12s)
16:18:16 [2025-04-03T16:18:16.298Z] --- [32mPASS[0m: basic.nvme/DbusPerms (0.34s)
16:18:16 [2025-04-03T16:18:16.298Z] --- [32mPASS[0m: basic.nvme/ServicesActive (0.13s)
16:18:16 [2025-04-03T16:18:16.298Z] --- [32mPASS[0m: basic.nvme/ReadOnly (0.11s)
16:18:38 [2025-04-03T16:18:38.164Z] --- [32mPASS[0m: ext.config.systemd.network-online (38.92s)
16:18:44 [2025-04-03T16:18:44.679Z] --- [32mPASS[0m: rhcos.selinux.boolean.persist (61.14s)
16:18:56 [2025-04-03T16:18:56.838Z] --- [32mPASS[0m: ext.config.ssh.custom-host-key-permissions (40.05s)
16:19:35 [2025-04-03T16:19:35.480Z] --- [32mPASS[0m: coreos.auth.verify (35.86s)
16:19:40 [2025-04-03T16:19:40.705Z] --- [32mPASS[0m: ext.config.reboot (57.09s)
16:19:52 [2025-04-03T16:19:52.857Z] --- [32mPASS[0m: multipath.day1 (77.74s)
16:20:19 [2025-04-03T16:20:19.328Z] --- [32mPASS[0m: coreos.ignition.groups (37.57s)
16:20:31 [2025-04-03T16:20:31.467Z] --- [32mPASS[0m: ext.config.ignition.systemd-enable-units (38.46s)
16:20:46 [2025-04-03T16:20:46.282Z] --- [32mPASS[0m: ext.config.butane.grub-users (73.86s)
16:21:12 [2025-04-03T16:21:12.735Z] --- [32mPASS[0m: ext.config.gshadow (38.41s)
16:21:13 [2025-04-03T16:21:13.291Z] --- [32mPASS[0m: coreos.ignition.mount.partitions (55.06s)
16:21:51 [2025-04-03T16:21:51.917Z] --- [32mPASS[0m: fcos.network.listeners (36.20s)
16:21:56 [2025-04-03T16:21:56.066Z] --- [32mPASS[0m: ext.config.ntp.chrony.dhcp-propagation (70.86s)
16:21:56 [2025-04-03T16:21:56.986Z] --- [32mPASS[0m: ext.config.ignition.remote (47.69s)
16:22:06 [2025-04-03T16:22:06.900Z] === RUN podman.workflow/exec
16:22:06 [2025-04-03T16:22:06.900Z] === RUN podman.workflow/stop
16:22:16 [2025-04-03T16:22:16.815Z] === RUN podman.workflow/remove
16:22:17 [2025-04-03T16:22:17.070Z] === RUN podman.workflow/delete
16:22:21 [2025-04-03T16:22:21.227Z] --- [32mPASS[0m: podman.workflow (355.58s)
16:22:21 [2025-04-03T16:22:21.227Z] --- [32mPASS[0m: podman.workflow/run (307.04s)
16:22:21 [2025-04-03T16:22:21.227Z] cluster.go:151: Trying to pull quay.io/fedora/fedora:latest...
16:22:21 [2025-04-03T16:22:21.227Z] cluster.go:151: Getting image source signatures
16:22:21 [2025-04-03T16:22:21.227Z] cluster.go:151: Copying blob sha256:5d73e6141b7edf8d9b620abe19f9a49223cd7cdc0a8e4cb959c8216024eae112
16:22:21 [2025-04-03T16:22:21.227Z] cluster.go:151: Copying config sha256:c6469921080786d242cb0ac957e4b804d8c11b0099cdc9ee95fc7ab19aade2f4
16:22:21 [2025-04-03T16:22:21.227Z] cluster.go:151: Writing manifest to image destination
16:22:21 [2025-04-03T16:22:21.227Z] --- [32mPASS[0m: podman.workflow/exec (0.38s)
16:22:21 [2025-04-03T16:22:21.227Z] --- [32mPASS[0m: podman.workflow/stop (10.70s)
16:22:21 [2025-04-03T16:22:21.227Z] --- [32mPASS[0m: podman.workflow/remove (0.60s)
16:22:21 [2025-04-03T16:22:21.227Z] --- [32mPASS[0m: podman.workflow/delete (0.72s)
16:22:21 [2025-04-03T16:22:21.227Z] cluster.go:151: grep: quay.io/fedora/fedora:latest: No such file or directory
16:22:21 [2025-04-03T16:22:21.227Z] cluster.go:151: bash: line 2: Deleted:: command not found
16:22:31 [2025-04-03T16:22:31.143Z] === RUN podman.base/info
16:22:31 [2025-04-03T16:22:31.143Z] === RUN podman.base/resources
16:22:31 [2025-04-03T16:22:31.700Z] --- [32mPASS[0m: ext.config.networking.nameserver (42.17s)
16:22:38 [2025-04-03T16:22:38.211Z] --- [32mPASS[0m: ext.config.networking.prefer-ignition-networking (41.35s)
16:22:38 [2025-04-03T16:22:38.211Z] --- [32mPASS[0m: podman.base (40.61s)
16:22:38 [2025-04-03T16:22:38.211Z] --- [32mPASS[0m: podman.base/info (0.43s)
16:22:38 [2025-04-03T16:22:38.211Z] --- [32mPASS[0m: podman.base/resources (4.36s)
16:23:00 [2025-04-03T16:23:00.059Z] --- [32mPASS[0m: coreos.ignition.sethostname (36.47s)
16:23:04 [2025-04-03T16:23:04.211Z] === RUN fcos.filesystem/writablefiles
16:23:05 [2025-04-03T16:23:05.131Z] === RUN fcos.filesystem/writabledirs
16:23:05 [2025-04-03T16:23:05.384Z] === RUN fcos.filesystem/stickydirs
16:23:05 [2025-04-03T16:23:05.637Z] === RUN fcos.filesystem/denylist
16:23:09 [2025-04-03T16:23:09.784Z] --- [32mPASS[0m: fcos.filesystem (37.64s)
16:23:09 [2025-04-03T16:23:09.784Z] --- [32mPASS[0m: fcos.filesystem/writablefiles (0.84s)
16:23:09 [2025-04-03T16:23:09.784Z] --- [32mPASS[0m: fcos.filesystem/writabledirs (0.26s)
16:23:09 [2025-04-03T16:23:09.784Z] --- [32mPASS[0m: fcos.filesystem/stickydirs (0.29s)
16:23:09 [2025-04-03T16:23:09.784Z] --- [32mPASS[0m: fcos.filesystem/denylist (0.37s)
16:23:17 [2025-04-03T16:23:17.839Z] --- [32mPASS[0m: ext.config.ignition.systemd-unmasking (38.99s)
16:23:20 [2025-04-03T16:23:20.339Z] --- [32mPASS[0m: ext.config.networking.team-dhcp-via-ignition (42.22s)
16:23:52 [2025-04-03T16:23:52.343Z] --- [32mPASS[0m: ext.config.ignition.stable-boot (38.83s)
16:23:54 [2025-04-03T16:23:54.855Z] --- [32mPASS[0m: ext.config.ignition.kargs (38.34s)
16:24:16 [2025-04-03T16:24:16.731Z] --- [32mPASS[0m: coreos.ignition.once (54.42s)
16:24:29 [2025-04-03T16:24:29.435Z] === RUN ostree.remote/add
16:24:29 [2025-04-03T16:24:29.435Z] === RUN ostree.remote/list
16:24:29 [2025-04-03T16:24:29.435Z] === RUN ostree.remote/show-url
16:24:29 [2025-04-03T16:24:29.435Z] === RUN ostree.remote/refs
16:24:29 [2025-04-03T16:24:29.435Z] === RUN ostree.remote/summary
16:24:29 [2025-04-03T16:24:29.435Z] === RUN ostree.remote/delete
16:24:32 [2025-04-03T16:24:32.685Z] --- [32mPASS[0m: ostree.remote (37.24s)
16:24:32 [2025-04-03T16:24:32.685Z] --- [32mPASS[0m: ostree.remote/add (0.24s)
16:24:32 [2025-04-03T16:24:32.685Z] --- [32mPASS[0m: ostree.remote/list (0.10s)
16:24:32 [2025-04-03T16:24:32.685Z] --- [32mPASS[0m: ostree.remote/show-url (0.20s)
16:24:32 [2025-04-03T16:24:32.685Z] --- [32mPASS[0m: ostree.remote/refs (0.16s)
16:24:32 [2025-04-03T16:24:32.685Z] --- [32mPASS[0m: ostree.remote/summary (0.29s)
16:24:32 [2025-04-03T16:24:32.685Z] --- [32mPASS[0m: ostree.remote/delete (0.44s)
16:24:44 [2025-04-03T16:24:44.824Z] --- [32mPASS[0m: ext.config.networking.nmstate.state (56.66s)
16:24:50 [2025-04-03T16:24:50.047Z] --- [32mPASS[0m: kdump.crash.ssh (112.27s)
16:24:50 [2025-04-03T16:24:50.047Z] cluster.go:151: Running as unit: run-p7202-i7203.service; invocation ID: d21736514b2f4a9b8af446e4456189ee
16:25:11 [2025-04-03T16:25:11.897Z] --- [32mPASS[0m: ext.config.selinux.enforcing (55.36s)
16:25:19 [2025-04-03T16:25:19.965Z] --- [32mPASS[0m: ext.config.docker.basic (47.04s)
16:25:24 [2025-04-03T16:25:24.111Z] --- [32mPASS[0m: ext.config.firewall.iptables-legacy (38.68s)
16:25:42 [2025-04-03T16:25:42.114Z] === RUN non-exclusive-test-bucket-0/ext.config.networking.no-default-initramfs-net-propagation.default
16:25:42 [2025-04-03T16:25:42.114Z] === RUN non-exclusive-test-bucket-0/ext.config.swap.zram-default
16:25:42 [2025-04-03T16:25:42.114Z] === RUN non-exclusive-test-bucket-0/ext.config.networking.default-network-behavior-change
16:25:42 [2025-04-03T16:25:42.367Z] === RUN rpmostree.upgrade-rollback/upgrade
16:25:43 [2025-04-03T16:25:43.722Z] === RUN non-exclusive-test-bucket-0/ext.config.files.kernel-headers
16:25:44 [2025-04-03T16:25:44.290Z] === RUN non-exclusive-test-bucket-0/ext.config.files.aleph-version
16:25:44 [2025-04-03T16:25:44.847Z] === RUN non-exclusive-test-bucket-0/ext.config.selinux.file-context-policy-match
16:25:49 [2025-04-03T16:25:49.069Z] === RUN non-exclusive-test-bucket-0/ext.config.files.rpmdb-sqlite
16:25:49 [2025-04-03T16:25:49.069Z] === RUN non-exclusive-test-bucket-0/ext.config.files.system-generators
16:25:50 [2025-04-03T16:25:50.943Z] === RUN non-exclusive-test-bucket-0/ext.config.disks.growfs
16:25:51 [2025-04-03T16:25:51.501Z] === RUN non-exclusive-test-bucket-0/ext.config.files.console-config
16:25:53 [2025-04-03T16:25:53.387Z] === RUN non-exclusive-test-bucket-0/ext.config.clhm.network-device-info
16:25:54 [2025-04-03T16:25:54.760Z] === RUN non-exclusive-test-bucket-0/ext.config.networking.nm-start
16:25:56 [2025-04-03T16:25:56.115Z] --- [32mPASS[0m: coreos.ignition.instantiated.enable-unit (37.09s)
16:25:56 [2025-04-03T16:25:56.368Z] === RUN non-exclusive-test-bucket-0/ext.config.kdump.service
16:25:58 [2025-04-03T16:25:58.242Z] === RUN non-exclusive-test-bucket-0/ext.config.disks.root-boot-ro
16:25:59 [2025-04-03T16:25:59.608Z] === RUN non-exclusive-test-bucket-0/ext.config.files.initrd.executables
16:26:04 [2025-04-03T16:26:04.831Z] === RUN non-exclusive-test-bucket-0/ext.config.content-origins
16:26:05 [2025-04-03T16:26:05.751Z] === RUN non-exclusive-test-bucket-0/ext.config.files.initrd.compression
16:26:07 [2025-04-03T16:26:07.627Z] === RUN non-exclusive-test-bucket-0/ext.config.files.root-bash
16:26:08 [2025-04-03T16:26:08.183Z] === RUN non-exclusive-test-bucket-0/ext.config.files.validate-symlinks
16:26:20 [2025-04-03T16:26:20.327Z] === RUN rpmostree.upgrade-rollback/rollback
16:26:20 [2025-04-03T16:26:20.327Z] === RUN non-exclusive-test-bucket-0/ext.config.selinux.unmodified-policy
16:26:21 [2025-04-03T16:26:21.683Z] === RUN non-exclusive-test-bucket-0/ext.config.files.setgid
16:26:23 [2025-04-03T16:26:23.560Z] === RUN non-exclusive-test-bucket-0/ext.config.files.initrd.expected-contents
16:26:27 [2025-04-03T16:26:27.705Z] === RUN non-exclusive-test-bucket-0/ext.config.files.check-symlink
16:26:28 [2025-04-03T16:26:28.269Z] --- [32mPASS[0m: ext.config.extensions.package (64.80s)
16:26:28 [2025-04-03T16:26:28.823Z] === RUN non-exclusive-test-bucket-0/ext.config.files.fcos_users
16:26:30 [2025-04-03T16:26:30.699Z] === RUN non-exclusive-test-bucket-0/ext.config.rpm-ostree.container-deps
16:26:32 [2025-04-03T16:26:32.054Z] === RUN non-exclusive-test-bucket-0/ext.config.systemd.no-systemd-firstboot
16:26:33 [2025-04-03T16:26:33.930Z] === RUN non-exclusive-test-bucket-0/ext.config.files.setuid
16:26:35 [2025-04-03T16:26:35.808Z] === RUN non-exclusive-test-bucket-0/ext.config.files.etc-permissions
16:26:37 [2025-04-03T16:26:37.164Z] === RUN non-exclusive-test-bucket-0/ext.config.selinux.usrlocal-context
16:26:38 [2025-04-03T16:26:38.083Z] === RUN non-exclusive-test-bucket-0/ext.config.files.yum-repo-dir
16:26:38 [2025-04-03T16:26:38.639Z] --- [32mPASS[0m: ext.config.networking.mtu-on-bond-ignition (42.37s)
16:26:38 [2025-04-03T16:26:38.639Z] === RUN non-exclusive-test-bucket-0/ext.config.kubernetes.kube-watch
16:26:41 [2025-04-03T16:26:41.900Z] === RUN non-exclusive-test-bucket-0/ext.config.files.logrotate-service
16:26:43 [2025-04-03T16:26:43.255Z] === RUN non-exclusive-test-bucket-0/ext.config.files.root-immutable-bit
16:26:43 [2025-04-03T16:26:43.811Z] === RUN non-exclusive-test-bucket-0/ext.config.selinux.podman-tmpfs-context
16:26:46 [2025-04-03T16:26:46.312Z] --- [32mPASS[0m: rpmostree.upgrade-rollback (96.17s)
16:26:46 [2025-04-03T16:26:46.312Z] --- [32mPASS[0m: rpmostree.upgrade-rollback/upgrade (37.32s)
16:26:46 [2025-04-03T16:26:46.312Z] --- [32mPASS[0m: rpmostree.upgrade-rollback/rollback (22.57s)
16:26:51 [2025-04-03T16:26:51.533Z] === RUN non-exclusive-test-bucket-0/ext.config.firewall.iptables
16:26:53 [2025-04-03T16:26:53.411Z] === RUN non-exclusive-test-bucket-0/ext.config.networking.tls
16:26:55 [2025-04-03T16:26:55.289Z] 2025-04-03T16:26:54Z kola: Test timed out. Adding as candidate for rerun success: ext.config.systemd.condition-needs-update
16:26:55 [2025-04-03T16:26:55.289Z] --- [31mFAIL[0m: ext.config.systemd.condition-needs-update (602.84s)
16:26:55 [2025-04-03T16:26:55.289Z] harness.go:106: TIMEOUT[10m0s]: SSH unsuccessful within allotted timeframe for 36d35c14-c35e-473f-80fe-ff83f04f0c3f.
16:26:55 [2025-04-03T16:26:55.289Z] harness.go:1735: Found kernel oops on machine 36d35c14-c35e-473f-80fe-ff83f04f0c3f console
16:26:57 [2025-04-03T16:26:57.789Z] === RUN non-exclusive-test-bucket-0/ext.config.disks.systemd-repart-service
16:26:59 [2025-04-03T16:26:59.665Z] === RUN non-exclusive-test-bucket-0/ext.config.disks.no-google-device-links
16:27:00 [2025-04-03T16:27:00.222Z] === RUN non-exclusive-test-bucket-0/ext.config.security.passwd
16:27:03 [2025-04-03T16:27:03.140Z] === RUN non-exclusive-test-bucket-0/ext.config.disks.partition-scheme
16:27:05 [2025-04-03T16:27:05.015Z] === RUN non-exclusive-test-bucket-0/ext.config.files.license
16:27:05 [2025-04-03T16:27:05.015Z] --- [32mPASS[0m: ext.config.networking.hostname.fallback-hostname (36.74s)
16:27:06 [2025-04-03T16:27:06.369Z] === RUN non-exclusive-test-bucket-0/ext.config.composefs.enabled
16:27:08 [2025-04-03T16:27:08.254Z] === RUN non-exclusive-test-bucket-0/ext.config.ntp.chrony.coreos-platform-chrony-config
16:27:09 [2025-04-03T16:27:09.974Z] === RUN non-exclusive-test-bucket-0/ext.config.disks.tmpfs
16:27:10 [2025-04-03T16:27:10.530Z] === RUN non-exclusive-test-bucket-0/ext.config.kubernetes.systemd-env-read
16:27:12 [2025-04-03T16:27:12.406Z] === RUN non-exclusive-test-bucket-0/ext.config.files.sudoers
16:27:13 [2025-04-03T16:27:13.770Z] === RUN non-exclusive-test-bucket-0/ext.config.boot.bootupd
16:27:15 [2025-04-03T16:27:15.646Z] === RUN non-exclusive-test-bucket-0/ext.config.containers.cgroups-v2
16:27:17 [2025-04-03T16:27:17.534Z] === RUN non-exclusive-test-bucket-0/ext.config.files.amd-ucode-firmware
16:27:18 [2025-04-03T16:27:18.090Z] === RUN non-exclusive-test-bucket-0/ext.config.networking.dnsmasq-service
16:27:19 [2025-04-03T16:27:19.968Z] === RUN non-exclusive-test-bucket-0/ext.config.networking.nic-naming
16:27:21 [2025-04-03T16:27:21.323Z] === RUN non-exclusive-test-bucket-0/ext.config.disks.root-prjquota
16:27:22 [2025-04-03T16:27:22.243Z] === RUN non-exclusive-test-bucket-0/ext.config.networking.network-online-service
16:27:23 [2025-04-03T16:27:23.609Z] === RUN non-exclusive-test-bucket-0/ext.config.networking.resolv.systemd-resolved
16:27:25 [2025-04-03T16:27:25.486Z] === RUN non-exclusive-test-bucket-0/ext.config.files.fwupd-refresh-timer
16:27:27 [2025-04-03T16:27:27.361Z] === RUN non-exclusive-test-bucket-0/ext.config.logging.printk
16:27:27 [2025-04-03T16:27:27.918Z] === RUN non-exclusive-test-bucket-0/ext.config.networking.nm-ifcfg-rh-plugin
16:27:29 [2025-04-03T16:27:29.804Z] === RUN non-exclusive-test-bucket-0/ext.config.files.fcos_groups
16:27:31 [2025-04-03T16:27:31.160Z] systemctl status kola-runext-22.service:
16:27:31 [2025-04-03T16:27:31.160Z] �� kola-runext-22.service
16:27:31 [2025-04-03T16:27:31.160Z] Loaded: loaded (/etc/systemd/system/kola-runext-22.service; static)
16:27:31 [2025-04-03T16:27:31.160Z] Drop-In: /usr/lib/systemd/system/service.d
16:27:31 [2025-04-03T16:27:31.160Z] ������10-timeout-abort.conf, 50-keep-warm.conf
16:27:31 [2025-04-03T16:27:31.160Z] Active: failed (Result: exit-code) since Thu 2025-04-03 16:27:30 UTC; 1s ago
16:27:31 [2025-04-03T16:27:31.160Z] Duration: 183ms
16:27:31 [2025-04-03T16:27:31.160Z] Invocation: 79d4268a22b4429bb306a7d2c8132052
16:27:31 [2025-04-03T16:27:31.160Z] Process: 19338 ExecStart=/usr/local/bin/kola-runext-fcos_groups (code=exited, status=1/FAILURE)
16:27:31 [2025-04-03T16:27:31.160Z] Main PID: 19338 (code=exited, status=1/FAILURE)
16:27:31 [2025-04-03T16:27:31.160Z] Mem peak: 1.2M
16:27:31 [2025-04-03T16:27:31.160Z] CPU: 98ms
16:27:31 [2025-04-03T16:27:31.160Z]
16:27:31 [2025-04-03T16:27:31.160Z] Apr 03 16:27:30 qemu0 kola-runext-fcos_groups[19372]: systemd-journal:x:190:
16:27:31 [2025-04-03T16:27:31.160Z] Apr 03 16:27:30 qemu0 kola-runext-fcos_groups[19372]: polkitd:x:998:
16:27:31 [2025-04-03T16:27:31.160Z] Apr 03 16:27:30 qemu0 kola-runext-fcos_groups[19372]: etcd:x:997:
16:27:31 [2025-04-03T16:27:31.160Z] Apr 03 16:27:30 qemu0 kola-runext-fcos_groups[19372]: dip:x:40:
16:27:31 [2025-04-03T16:27:31.160Z] Apr 03 16:27:30 qemu0 kola-runext-fcos_groups[19372]: cgred:x:996:
16:27:31 [2025-04-03T16:27:31.161Z] Apr 03 16:27:30 qemu0 kola-runext-fcos_groups[19372]: avahi-autoipd:x:170:
16:27:31 [2025-04-03T16:27:31.161Z] Apr 03 16:27:30 qemu0 kola-runext-fcos_groups[19372]: sssd:x:993:
16:27:31 [2025-04-03T16:27:31.161Z] Apr 03 16:27:30 qemu0 kola-runext-fcos_groups[19372]: dockerroot:x:986:
16:27:31 [2025-04-03T16:27:31.161Z] Apr 03 16:27:30 qemu0 kola-runext-fcos_groups[19372]: rpcuser:x:29:
16:27:31 [2025-04-03T16:27:31.161Z] Apr 03 16:27:30 qemu0 kola-runext-fcos_groups[19372]: nfsnobody:x:65534:
16:27:31 [2025-04-03T16:27:31.161Z] Apr 03 16:27:30 qemu0 kola-runext-fcos_groups[19372]: kube:x:994:
16:27:31 [2025-04-03T16:27:31.161Z] Apr 03 16:27:30 qemu0 kola-runext-fcos_groups[19372]: chrony:x:992:
16:27:31 [2025-04-03T16:27:31.161Z] Apr 03 16:27:30 qemu0 kola-runext-fcos_groups[19372]: tcpdump:x:72:
16:27:31 [2025-04-03T16:27:31.161Z] Apr 03 16:27:30 qemu0 kola-runext-fcos_groups[19372]: ceph:x:167:
16:27:31 [2025-04-03T16:27:31.161Z] Apr 03 16:27:30 qemu0 kola-runext-fcos_groups[19372]: input:x:104:
16:27:31 [2025-04-03T16:27:31.161Z] Apr 03 16:27:30 qemu0 kola-runext-fcos_groups[19372]: systemd-timesync:x:991:
16:27:31 [2025-04-03T16:27:31.161Z] Apr 03 16:27:30 qemu0 kola-runext-fcos_groups[19372]: systemd-network:x:990:
16:27:31 [2025-04-03T16:27:31.161Z] Apr 03 16:27:30 qemu0 kola-runext-fcos_groups[19372]: systemd-resolve:x:989:
16:27:31 [2025-04-03T16:27:31.161Z] Apr 03 16:27:30 qemu0 kola-runext-fcos_groups[19372]: systemd-bus-proxy:x:988:
16:27:31 [2025-04-03T16:27:31.161Z] Apr 03 16:27:30 qemu0 kola-runext-fcos_groups[19372]: cockpit-ws:x:987:
16:27:31 [2025-04-03T16:27:31.161Z] Apr 03 16:27:30 qemu0 kola-runext-fcos_groups[19372]: docker:x:985:
16:27:31 [2025-04-03T16:27:31.161Z] Apr 03 16:27:30 qemu0 kola-runext-fcos_groups[19372]: printadmin:x:984:
16:27:31 [2025-04-03T16:27:31.161Z] Apr 03 16:27:30 qemu0 kola-runext-fcos_groups[19372]: utmp:x:22:
16:27:31 [2025-04-03T16:27:31.161Z] Apr 03 16:27:30 qemu0 kola-runext-fcos_groups[19372]: kvm:x:36:
16:27:31 [2025-04-03T16:27:31.161Z] Apr 03 16:27:30 qemu0 kola-runext-fcos_groups[19372]: clock:x:103:
16:27:31 [2025-04-03T16:27:31.161Z] Apr 03 16:27:30 qemu0 kola-runext-fcos_groups[19372]: render:x:105:
16:27:31 [2025-04-03T16:27:31.161Z] Apr 03 16:27:30 qemu0 kola-runext-fcos_groups[19372]: sgx:x:106:
16:27:31 [2025-04-03T16:27:31.161Z] Apr 03 16:27:30 qemu0 kola-runext-fcos_groups[19372]: zincati:x:983:
16:27:31 [2025-04-03T16:27:31.161Z] Apr 03 16:27:30 qemu0 kola-runext-fcos_groups[19372]: clevis:x:982:
16:27:31 [2025-04-03T16:27:31.161Z] Apr 03 16:27:30 qemu0 kola-runext-fcos_groups[19372]: dbus:x:981:
16:27:31 [2025-04-03T16:27:31.161Z] Apr 03 16:27:30 qemu0 kola-runext-fcos_groups[19372]: dnsmasq:x:980:
16:27:31 [2025-04-03T16:27:31.161Z] Apr 03 16:27:30 qemu0 kola-runext-fcos_groups[19372]: sshd:x:979:
16:27:31 [2025-04-03T16:27:31.161Z] Apr 03 16:27:30 qemu0 kola-runext-fcos_groups[19372]: rpc:x:978:
16:27:31 [2025-04-03T16:27:31.161Z] Apr 03 16:27:30 qemu0 kola-runext-fcos_groups[19372]: systemd-coredump:x:977:
16:27:31 [2025-04-03T16:27:31.161Z] Apr 03 16:27:30 qemu0 kola-runext-fcos_groups[19372]: systemd-oom:x:976:
16:27:31 [2025-04-03T16:27:31.161Z] Apr 03 16:27:30 qemu0 kola-runext-fcos_groups[19372]: tss:x:59:clevis
16:27:31 [2025-04-03T16:27:31.161Z] Apr 03 16:27:30 qemu0 kola-runext-fcos_groups[19372]: utempter:x:35:
16:27:31 [2025-04-03T16:27:31.161Z] Apr 03 16:27:30 qemu0 kola-runext-fcos_groups[19338]: failure on extra_group_static entry rpc
16:27:31 [2025-04-03T16:27:31.161Z] Apr 03 16:27:30 qemu0 systemd[1]: kola-runext-22.service: Main process exited, code=exited, status=1/FAILURE
16:27:31 [2025-04-03T16:27:31.161Z] Apr 03 16:27:30 qemu0 systemd[1]: kola-runext-22.service: Failed with result 'exit-code'.
16:27:31 [2025-04-03T16:27:31.415Z] === RUN non-exclusive-test-bucket-0/ext.config.podman.rootless-pasta-networking
16:27:39 [2025-04-03T16:27:39.476Z] === RUN non-exclusive-test-bucket-0/ext.config.files.file-directory-permissions
16:27:40 [2025-04-03T16:27:40.831Z] === RUN non-exclusive-test-bucket-0/ext.config.selinux.stub-resolve-context
16:27:42 [2025-04-03T16:27:42.707Z] === RUN non-exclusive-test-bucket-0/ext.config.files.remove-manifest-files
16:27:44 [2025-04-03T16:27:44.063Z] === RUN non-exclusive-test-bucket-0/ext.config.systemd.default-unit-timeouts
16:27:45 [2025-04-03T16:27:45.937Z] === RUN non-exclusive-test-bucket-0/ext.config.security.coreos-update-ca-trust
16:27:47 [2025-04-03T16:27:47.811Z] === RUN non-exclusive-test-bucket-0/ext.config.ignition.journald-log
16:27:49 [2025-04-03T16:27:49.166Z] === RUN non-exclusive-test-bucket-0/ext.config.podman.dns
16:27:51 [2025-04-03T16:27:51.043Z] === RUN non-exclusive-test-bucket-0/ext.config.networking.nm-dhcp-client
16:27:56 [2025-04-03T16:27:56.268Z] --- [31mFAIL[0m: non-exclusive-test-bucket-0 (186.28s)
16:27:56 [2025-04-03T16:27:56.268Z] --- [32mPASS[0m: non-exclusive-test-bucket-0/ext.config.networking.no-default-initramfs-net-propagation.default (1.64s)
16:27:56 [2025-04-03T16:27:56.268Z] --- [32mPASS[0m: non-exclusive-test-bucket-0/ext.config.swap.zram-default (0.65s)
16:27:56 [2025-04-03T16:27:56.268Z] --- [32mPASS[0m: non-exclusive-test-bucket-0/ext.config.networking.default-network-behavior-change (1.64s)
16:27:56 [2025-04-03T16:27:56.268Z] --- [32mPASS[0m: non-exclusive-test-bucket-0/ext.config.files.kernel-headers (0.63s)
16:27:56 [2025-04-03T16:27:56.268Z] --- [32mPASS[0m: non-exclusive-test-bucket-0/ext.config.files.aleph-version (0.61s)
16:27:56 [2025-04-03T16:27:56.268Z] --- [32mPASS[0m: non-exclusive-test-bucket-0/ext.config.selinux.file-context-policy-match (3.63s)
16:27:56 [2025-04-03T16:27:56.268Z] --- [32mPASS[0m: non-exclusive-test-bucket-0/ext.config.files.rpmdb-sqlite (0.64s)
16:27:56 [2025-04-03T16:27:56.268Z] --- [32mPASS[0m: non-exclusive-test-bucket-0/ext.config.files.system-generators (1.63s)
16:27:56 [2025-04-03T16:27:56.268Z] --- [32mPASS[0m: non-exclusive-test-bucket-0/ext.config.disks.growfs (0.61s)
16:27:56 [2025-04-03T16:27:56.268Z] --- [32mPASS[0m: non-exclusive-test-bucket-0/ext.config.files.console-config (1.69s)
16:27:56 [2025-04-03T16:27:56.268Z] --- [32mPASS[0m: non-exclusive-test-bucket-0/ext.config.clhm.network-device-info (1.63s)
16:27:56 [2025-04-03T16:27:56.268Z] --- [32mPASS[0m: non-exclusive-test-bucket-0/ext.config.networking.nm-start (1.64s)
16:27:56 [2025-04-03T16:27:56.268Z] --- [32mPASS[0m: non-exclusive-test-bucket-0/ext.config.kdump.service (1.63s)
16:27:56 [2025-04-03T16:27:56.268Z] --- [32mPASS[0m: non-exclusive-test-bucket-0/ext.config.disks.root-boot-ro (1.66s)
16:27:56 [2025-04-03T16:27:56.268Z] --- [32mPASS[0m: non-exclusive-test-bucket-0/ext.config.files.initrd.executables (4.62s)
16:27:56 [2025-04-03T16:27:56.268Z] --- [32mPASS[0m: non-exclusive-test-bucket-0/ext.config.content-origins (1.62s)
16:27:56 [2025-04-03T16:27:56.268Z] --- [32mPASS[0m: non-exclusive-test-bucket-0/ext.config.files.initrd.compression (1.61s)
16:27:56 [2025-04-03T16:27:56.268Z] --- [32mPASS[0m: non-exclusive-test-bucket-0/ext.config.files.root-bash (0.62s)
16:27:56 [2025-04-03T16:27:56.268Z] --- [32mPASS[0m: non-exclusive-test-bucket-0/ext.config.files.validate-symlinks (11.95s)
16:27:56 [2025-04-03T16:27:56.268Z] --- [32mPASS[0m: non-exclusive-test-bucket-0/ext.config.selinux.unmodified-policy (1.68s)
16:27:56 [2025-04-03T16:27:56.268Z] --- [32mPASS[0m: non-exclusive-test-bucket-0/ext.config.files.setgid (1.72s)
16:27:56 [2025-04-03T16:27:56.268Z] --- [32mPASS[0m: non-exclusive-test-bucket-0/ext.config.files.initrd.expected-contents (3.70s)
16:27:56 [2025-04-03T16:27:56.268Z] --- [32mPASS[0m: non-exclusive-test-bucket-0/ext.config.files.check-symlink (1.68s)
16:27:56 [2025-04-03T16:27:56.268Z] --- [32mPASS[0m: non-exclusive-test-bucket-0/ext.config.files.fcos_users (1.66s)
16:27:56 [2025-04-03T16:27:56.268Z] --- [32mPASS[0m: non-exclusive-test-bucket-0/ext.config.rpm-ostree.container-deps (1.68s)
16:27:56 [2025-04-03T16:27:56.268Z] --- [32mPASS[0m: non-exclusive-test-bucket-0/ext.config.systemd.no-systemd-firstboot (1.70s)
16:27:56 [2025-04-03T16:27:56.268Z] --- [32mPASS[0m: non-exclusive-test-bucket-0/ext.config.files.setuid (1.73s)
16:27:56 [2025-04-03T16:27:56.268Z] --- [32mPASS[0m: non-exclusive-test-bucket-0/ext.config.files.etc-permissions (1.71s)
16:27:56 [2025-04-03T16:27:56.268Z] --- [32mPASS[0m: non-exclusive-test-bucket-0/ext.config.selinux.usrlocal-context (0.69s)
16:27:56 [2025-04-03T16:27:56.268Z] --- [32mPASS[0m: non-exclusive-test-bucket-0/ext.config.files.yum-repo-dir (0.68s)
16:27:56 [2025-04-03T16:27:56.268Z] --- [32mPASS[0m: non-exclusive-test-bucket-0/ext.config.kubernetes.kube-watch (2.68s)
16:27:56 [2025-04-03T16:27:56.268Z] --- [32mPASS[0m: non-exclusive-test-bucket-0/ext.config.files.logrotate-service (1.65s)
16:27:56 [2025-04-03T16:27:56.268Z] --- [32mPASS[0m: non-exclusive-test-bucket-0/ext.config.files.root-immutable-bit (0.70s)
16:27:56 [2025-04-03T16:27:56.268Z] --- [32mPASS[0m: non-exclusive-test-bucket-0/ext.config.selinux.podman-tmpfs-context (7.72s)
16:27:56 [2025-04-03T16:27:56.268Z] --- [32mPASS[0m: non-exclusive-test-bucket-0/ext.config.firewall.iptables (1.69s)
16:27:56 [2025-04-03T16:27:56.268Z] --- [32mPASS[0m: non-exclusive-test-bucket-0/ext.config.networking.tls (4.70s)
16:27:56 [2025-04-03T16:27:56.268Z] --- [32mPASS[0m: non-exclusive-test-bucket-0/ext.config.disks.systemd-repart-service (1.70s)
16:27:56 [2025-04-03T16:27:56.268Z] --- [32mPASS[0m: non-exclusive-test-bucket-0/ext.config.disks.no-google-device-links (0.71s)
16:27:56 [2025-04-03T16:27:56.268Z] --- [32mPASS[0m: non-exclusive-test-bucket-0/ext.config.security.passwd (2.71s)
16:27:56 [2025-04-03T16:27:56.268Z] --- [32mPASS[0m: non-exclusive-test-bucket-0/ext.config.disks.partition-scheme (1.71s)
16:27:56 [2025-04-03T16:27:56.268Z] --- [32mPASS[0m: non-exclusive-test-bucket-0/ext.config.files.license (1.72s)
16:27:56 [2025-04-03T16:27:56.268Z] --- [32mPASS[0m: non-exclusive-test-bucket-0/ext.config.composefs.enabled (1.70s)
16:27:56 [2025-04-03T16:27:56.268Z] --- [32mPASS[0m: non-exclusive-test-bucket-0/ext.config.ntp.chrony.coreos-platform-chrony-config (1.69s)
16:27:56 [2025-04-03T16:27:56.268Z] --- [32mPASS[0m: non-exclusive-test-bucket-0/ext.config.disks.tmpfs (0.70s)
16:27:56 [2025-04-03T16:27:56.268Z] --- [32mPASS[0m: non-exclusive-test-bucket-0/ext.config.kubernetes.systemd-env-read (1.72s)
16:27:56 [2025-04-03T16:27:56.268Z] --- [32mPASS[0m: non-exclusive-test-bucket-0/ext.config.files.sudoers (1.70s)
16:27:56 [2025-04-03T16:27:56.268Z] --- [32mPASS[0m: non-exclusive-test-bucket-0/ext.config.boot.bootupd (1.69s)
16:27:56 [2025-04-03T16:27:56.268Z] --- [32mPASS[0m: non-exclusive-test-bucket-0/ext.config.containers.cgroups-v2 (1.70s)
16:27:56 [2025-04-03T16:27:56.268Z] --- [32mPASS[0m: non-exclusive-test-bucket-0/ext.config.files.amd-ucode-firmware (0.70s)
16:27:56 [2025-04-03T16:27:56.268Z] --- [32mPASS[0m: non-exclusive-test-bucket-0/ext.config.networking.dnsmasq-service (1.67s)
16:27:56 [2025-04-03T16:27:56.268Z] --- [32mPASS[0m: non-exclusive-test-bucket-0/ext.config.networking.nic-naming (1.68s)
16:27:56 [2025-04-03T16:27:56.268Z] --- [32mPASS[0m: non-exclusive-test-bucket-0/ext.config.disks.root-prjquota (0.70s)
16:27:56 [2025-04-03T16:27:56.268Z] --- [32mPASS[0m: non-exclusive-test-bucket-0/ext.config.networking.network-online-service (1.71s)
16:27:56 [2025-04-03T16:27:56.268Z] --- [32mPASS[0m: non-exclusive-test-bucket-0/ext.config.networking.resolv.systemd-resolved (1.68s)
16:27:56 [2025-04-03T16:27:56.268Z] --- [32mPASS[0m: non-exclusive-test-bucket-0/ext.config.files.fwupd-refresh-timer (1.69s)
16:27:56 [2025-04-03T16:27:56.268Z] --- [32mPASS[0m: non-exclusive-test-bucket-0/ext.config.logging.printk (0.69s)
16:27:56 [2025-04-03T16:27:56.268Z] --- [32mPASS[0m: non-exclusive-test-bucket-0/ext.config.networking.nm-ifcfg-rh-plugin (1.69s)
16:27:56 [2025-04-03T16:27:56.268Z] --- [31mFAIL[0m: non-exclusive-test-bucket-0/ext.config.files.fcos_groups (1.87s)
16:27:56 [2025-04-03T16:27:56.268Z] cluster.go:151: Error: Unit kola-runext-22.service exited with code 1
16:27:56 [2025-04-03T16:27:56.268Z] cluster.go:151: 2025-04-03T16:27:30Z cli: Unit kola-runext-22.service exited with code 1
16:27:56 [2025-04-03T16:27:56.268Z] harness.go:1260: kolet failed: : kolet run-test-unit failed: Process exited with status 1
16:27:56 [2025-04-03T16:27:56.268Z] --- [32mPASS[0m: non-exclusive-test-bucket-0/ext.config.podman.rootless-pasta-networking (7.71s)
16:27:56 [2025-04-03T16:27:56.268Z] --- [32mPASS[0m: non-exclusive-test-bucket-0/ext.config.files.file-directory-permissions (1.73s)
16:27:56 [2025-04-03T16:27:56.268Z] --- [32mPASS[0m: non-exclusive-test-bucket-0/ext.config.selinux.stub-resolve-context (1.68s)
16:27:56 [2025-04-03T16:27:56.268Z] --- [32mPASS[0m: non-exclusive-test-bucket-0/ext.config.files.remove-manifest-files (1.68s)
16:27:56 [2025-04-03T16:27:56.268Z] --- [32mPASS[0m: non-exclusive-test-bucket-0/ext.config.systemd.default-unit-timeouts (1.72s)
16:27:56 [2025-04-03T16:27:56.268Z] --- [32mPASS[0m: non-exclusive-test-bucket-0/ext.config.security.coreos-update-ca-trust (1.68s)
16:27:56 [2025-04-03T16:27:56.268Z] --- [32mPASS[0m: non-exclusive-test-bucket-0/ext.config.ignition.journald-log (1.67s)
16:27:56 [2025-04-03T16:27:56.268Z] --- [32mPASS[0m: non-exclusive-test-bucket-0/ext.config.podman.dns (1.70s)
16:27:56 [2025-04-03T16:27:56.268Z] --- [32mPASS[0m: non-exclusive-test-bucket-0/ext.config.networking.nm-dhcp-client (1.69s)
16:27:56 [2025-04-03T16:27:56.268Z] FAIL, output in /home/jenkins/agent/workspace/test-override/tmp/kola-iqjrr/kola-x86_64
16:27:56 [2025-04-03T16:27:56.268Z]
16:27:56 [2025-04-03T16:27:56.268Z]
16:27:56 [2025-04-03T16:27:56.268Z] ======== Re-running failed tests (flake detection) ========
16:27:56 [2025-04-03T16:27:56.268Z]
16:27:56 [2025-04-03T16:27:56.268Z] ���� Snoozing kola test pattern "ext.config.toolbox" until Apr 07 2025
16:27:56 [2025-04-03T16:27:56.268Z] ���� https://github.com/coreos/fedora-coreos-tracker/issues/1908
16:27:56 [2025-04-03T16:27:56.268Z] === RUN ext.config.files.fcos_groups
16:27:56 [2025-04-03T16:27:56.268Z] === RUN ext.config.systemd.condition-needs-update
16:28:34 [2025-04-03T16:28:34.890Z] systemctl status kola-runext-22.service:
16:28:34 [2025-04-03T16:28:34.890Z] �� kola-runext-22.service
16:28:34 [2025-04-03T16:28:34.890Z] Loaded: loaded (/etc/systemd/system/kola-runext-22.service; static)
16:28:34 [2025-04-03T16:28:34.890Z] Drop-In: /usr/lib/systemd/system/service.d
16:28:34 [2025-04-03T16:28:34.890Z] ������10-timeout-abort.conf, 50-keep-warm.conf
16:28:34 [2025-04-03T16:28:34.890Z] Active: failed (Result: exit-code) since Thu 2025-04-03 16:28:29 UTC; 972ms ago
16:28:34 [2025-04-03T16:28:34.890Z] Duration: 205ms
16:28:34 [2025-04-03T16:28:34.890Z] Invocation: 817f5d1750634d359ed6e7ea712685a4
16:28:34 [2025-04-03T16:28:34.890Z] Process: 2286 ExecStart=/usr/local/bin/kola-runext-fcos_groups (code=exited, status=1/FAILURE)
16:28:34 [2025-04-03T16:28:34.890Z] Main PID: 2286 (code=exited, status=1/FAILURE)
16:28:34 [2025-04-03T16:28:34.890Z] Mem peak: 1.2M
16:28:34 [2025-04-03T16:28:34.890Z] CPU: 98ms
16:28:34 [2025-04-03T16:28:34.890Z]
16:28:34 [2025-04-03T16:28:34.890Z] Apr 03 16:28:29 qemu0 kola-runext-fcos_groups[2322]: polkitd:x:998:
16:28:34 [2025-04-03T16:28:34.890Z] Apr 03 16:28:29 qemu0 kola-runext-fcos_groups[2322]: etcd:x:997:
16:28:34 [2025-04-03T16:28:34.890Z] Apr 03 16:28:29 qemu0 kola-runext-fcos_groups[2322]: dip:x:40:
16:28:34 [2025-04-03T16:28:34.890Z] Apr 03 16:28:29 qemu0 kola-runext-fcos_groups[2322]: cgred:x:996:
16:28:34 [2025-04-03T16:28:34.890Z] Apr 03 16:28:29 qemu0 kola-runext-fcos_groups[2322]: avahi-autoipd:x:170:
16:28:34 [2025-04-03T16:28:34.890Z] Apr 03 16:28:29 qemu0 kola-runext-fcos_groups[2322]: sssd:x:993:
16:28:34 [2025-04-03T16:28:34.890Z] Apr 03 16:28:29 qemu0 kola-runext-fcos_groups[2322]: dockerroot:x:986:
16:28:34 [2025-04-03T16:28:34.890Z] Apr 03 16:28:29 qemu0 kola-runext-fcos_groups[2322]: rpcuser:x:29:
16:28:34 [2025-04-03T16:28:34.890Z] Apr 03 16:28:29 qemu0 kola-runext-fcos_groups[2322]: nfsnobody:x:65534:
16:28:34 [2025-04-03T16:28:34.890Z] Apr 03 16:28:29 qemu0 kola-runext-fcos_groups[2322]: kube:x:994:
16:28:34 [2025-04-03T16:28:34.890Z] Apr 03 16:28:29 qemu0 kola-runext-fcos_groups[2322]: chrony:x:992:
16:28:34 [2025-04-03T16:28:34.890Z] Apr 03 16:28:29 qemu0 kola-runext-fcos_groups[2322]: tcpdump:x:72:
16:28:34 [2025-04-03T16:28:34.890Z] Apr 03 16:28:29 qemu0 kola-runext-fcos_groups[2322]: ceph:x:167:
16:28:34 [2025-04-03T16:28:34.890Z] Apr 03 16:28:29 qemu0 kola-runext-fcos_groups[2322]: input:x:104:
16:28:34 [2025-04-03T16:28:34.890Z] Apr 03 16:28:29 qemu0 kola-runext-fcos_groups[2322]: systemd-timesync:x:991:
16:28:34 [2025-04-03T16:28:34.890Z] Apr 03 16:28:29 qemu0 kola-runext-fcos_groups[2322]: systemd-network:x:990:
16:28:34 [2025-04-03T16:28:34.890Z] Apr 03 16:28:29 qemu0 kola-runext-fcos_groups[2322]: systemd-resolve:x:989:
16:28:34 [2025-04-03T16:28:34.890Z] Apr 03 16:28:29 qemu0 kola-runext-fcos_groups[2322]: systemd-bus-proxy:x:988:
16:28:34 [2025-04-03T16:28:34.890Z] Apr 03 16:28:29 qemu0 kola-runext-fcos_groups[2322]: cockpit-ws:x:987:
16:28:34 [2025-04-03T16:28:34.890Z] Apr 03 16:28:29 qemu0 kola-runext-fcos_groups[2322]: docker:x:985:
16:28:34 [2025-04-03T16:28:34.890Z] Apr 03 16:28:29 qemu0 kola-runext-fcos_groups[2322]: printadmin:x:984:
16:28:34 [2025-04-03T16:28:34.890Z] Apr 03 16:28:29 qemu0 kola-runext-fcos_groups[2322]: utmp:x:22:
16:28:34 [2025-04-03T16:28:34.890Z] Apr 03 16:28:29 qemu0 kola-runext-fcos_groups[2322]: kvm:x:36:
16:28:34 [2025-04-03T16:28:34.890Z] Apr 03 16:28:29 qemu0 kola-runext-fcos_groups[2322]: clock:x:103:
16:28:34 [2025-04-03T16:28:34.890Z] Apr 03 16:28:29 qemu0 kola-runext-fcos_groups[2322]: render:x:105:
16:28:34 [2025-04-03T16:28:34.890Z] Apr 03 16:28:29 qemu0 kola-runext-fcos_groups[2322]: sgx:x:106:
16:28:34 [2025-04-03T16:28:34.890Z] Apr 03 16:28:29 qemu0 kola-runext-fcos_groups[2322]: zincati:x:983:
16:28:34 [2025-04-03T16:28:34.890Z] Apr 03 16:28:29 qemu0 kola-runext-fcos_groups[2322]: clevis:x:982:
16:28:34 [2025-04-03T16:28:34.890Z] Apr 03 16:28:29 qemu0 kola-runext-fcos_groups[2322]: dbus:x:981:
16:28:34 [2025-04-03T16:28:34.890Z] Apr 03 16:28:29 qemu0 kola-runext-fcos_groups[2322]: dnsmasq:x:980:
16:28:34 [2025-04-03T16:28:34.890Z] Apr 03 16:28:29 qemu0 kola-runext-fcos_groups[2322]: sshd:x:979:
16:28:34 [2025-04-03T16:28:34.890Z] Apr 03 16:28:29 qemu0 kola-runext-fcos_groups[2322]: rpc:x:978:
16:28:34 [2025-04-03T16:28:34.890Z] Apr 03 16:28:29 qemu0 kola-runext-fcos_groups[2322]: systemd-coredump:x:977:
16:28:34 [2025-04-03T16:28:34.890Z] Apr 03 16:28:29 qemu0 kola-runext-fcos_groups[2322]: systemd-oom:x:976:
16:28:34 [2025-04-03T16:28:34.890Z] Apr 03 16:28:29 qemu0 kola-runext-fcos_groups[2322]: tss:x:59:clevis
16:28:34 [2025-04-03T16:28:34.890Z] Apr 03 16:28:29 qemu0 kola-runext-fcos_groups[2322]: utempter:x:35:
16:28:34 [2025-04-03T16:28:34.890Z] Apr 03 16:28:29 qemu0 kola-runext-fcos_groups[2322]: rpm-ostree:x:62011:
16:28:34 [2025-04-03T16:28:34.890Z] Apr 03 16:28:29 qemu0 kola-runext-fcos_groups[2286]: failure on extra_group_static entry rpc
16:28:34 [2025-04-03T16:28:34.890Z] Apr 03 16:28:29 qemu0 systemd[1]: kola-runext-22.service: Main process exited, code=exited, status=1/FAILURE
16:28:34 [2025-04-03T16:28:34.890Z] Apr 03 16:28:29 qemu0 systemd[1]: kola-runext-22.service: Failed with result 'exit-code'.
16:28:35 [2025-04-03T16:28:35.447Z] --- [31mFAIL[0m: ext.config.files.fcos_groups (39.09s)
16:28:35 [2025-04-03T16:28:35.447Z] cluster.go:151: Error: Unit kola-runext-22.service exited with code 1
16:28:35 [2025-04-03T16:28:35.447Z] cluster.go:151: 2025-04-03T16:28:30Z cli: Unit kola-runext-22.service exited with code 1
16:28:35 [2025-04-03T16:28:35.447Z] harness.go:1260: kolet failed: : kolet run-test-unit failed: Process exited with status 1
16:29:31 [2025-04-03T16:29:31.572Z] --- [32mPASS[0m: ext.config.systemd.condition-needs-update (92.16s)
16:29:31 [2025-04-03T16:29:31.572Z] FAIL, output in /home/jenkins/agent/workspace/test-override/tmp/kola-iqjrr/kola-x86_64/rerun
16:29:31 [2025-04-03T16:29:31.572Z] Error: harness: test suite failed
16:29:31 [2025-04-03T16:29:31.572Z] 2025-04-03T16:29:28Z cli: harness: test suite failed
16:29:31 [2025-04-03T16:29:31.572Z] failed to execute cmd-kola: exit status 1
16:29:31 [2025-04-03T16:29:31.574Z] [Pipeline] }
16:29:31 [2025-04-03T16:29:31.579Z] [Pipeline] // withEnv
16:29:31 [2025-04-03T16:29:31.636Z] [Pipeline] error
16:29:31 [2025-04-03T16:29:31.637Z] [Pipeline] }
16:29:31 [2025-04-03T16:29:31.638Z] Failed in branch x86_64:kola
16:29:31 [2025-04-03T16:29:31.703Z] [Pipeline] // parallel
16:29:31 [2025-04-03T16:29:31.708Z] [Pipeline] withEnv
16:29:31 [2025-04-03T16:29:31.709Z] [Pipeline] {
16:29:31 [2025-04-03T16:29:31.752Z] [Pipeline] sh
16:29:32 [2025-04-03T16:29:32.348Z] + set -xeuo pipefail
16:29:32 [2025-04-03T16:29:32.349Z] ++ umask
16:29:32 [2025-04-03T16:29:32.349Z] + '[' 0022 = 0000 ']'
16:29:32 [2025-04-03T16:29:32.349Z] + cd /home/jenkins/agent/workspace/test-override
16:29:32 [2025-04-03T16:29:32.349Z] + cosa shell -- test -d /home/jenkins/agent/workspace/test-override/tmp/kola-iqjrr/kola-upgrade-x86_64
16:29:32 [2025-04-03T16:29:32.350Z] [Pipeline] }
16:29:32 [2025-04-03T16:29:32.362Z] [Pipeline] // withEnv
16:29:32 [2025-04-03T16:29:32.368Z] [Pipeline] withEnv
16:29:32 [2025-04-03T16:29:32.368Z] [Pipeline] {
16:29:32 [2025-04-03T16:29:32.373Z] [Pipeline] sh
16:29:32 [2025-04-03T16:29:32.917Z] + set -xeuo pipefail
16:29:32 [2025-04-03T16:29:32.917Z] ++ umask
16:29:32 [2025-04-03T16:29:32.917Z] + '[' 0022 = 0000 ']'
16:29:32 [2025-04-03T16:29:32.917Z] + cd /home/jenkins/agent/workspace/test-override
16:29:32 [2025-04-03T16:29:32.917Z] + cosa shell -- tar -C /home/jenkins/agent/workspace/test-override/tmp/kola-iqjrr -c --xz kola-upgrade-x86_64
16:29:33 [2025-04-03T16:29:33.174Z] [Pipeline] }
16:29:33 [2025-04-03T16:29:33.177Z] [Pipeline] // withEnv
16:29:33 [2025-04-03T16:29:33.184Z] [Pipeline] archiveArtifacts
16:29:33 [2025-04-03T16:29:33.194Z] Archiving artifacts
16:29:33 [2025-04-03T16:29:33.708Z] [Pipeline] withEnv
16:29:33 [2025-04-03T16:29:33.710Z] [Pipeline] {
16:29:33 [2025-04-03T16:29:33.714Z] [Pipeline] sh
16:29:34 [2025-04-03T16:29:34.247Z] + set -xeuo pipefail
16:29:34 [2025-04-03T16:29:34.247Z] ++ umask
16:29:34 [2025-04-03T16:29:34.247Z] + '[' 0022 = 0000 ']'
16:29:34 [2025-04-03T16:29:34.247Z] + cd /home/jenkins/agent/workspace/test-override
16:29:34 [2025-04-03T16:29:34.247Z] + cosa shell -- /usr/lib/coreos-assembler/kola-junit --classname kola-upgrade-x86_64 --koladir /home/jenkins/agent/workspace/test-override/tmp/kola-iqjrr/kola-upgrade-x86_64 --output -
16:29:34 [2025-04-03T16:29:34.249Z] [Pipeline] }
16:29:34 [2025-04-03T16:29:34.262Z] [Pipeline] // withEnv
16:29:34 [2025-04-03T16:29:34.314Z] [Pipeline] junit
16:29:34 [2025-04-03T16:29:34.315Z] Recording test results
16:29:34 [2025-04-03T16:29:34.950Z] None of the test reports contained any result
16:29:34 [2025-04-03T16:29:34.952Z] [Pipeline] withEnv
16:29:34 [2025-04-03T16:29:34.952Z] [Pipeline] {
16:29:34 [2025-04-03T16:29:34.955Z] [Pipeline] sh
16:29:35 [2025-04-03T16:29:35.504Z] + set -xeuo pipefail
16:29:35 [2025-04-03T16:29:35.504Z] ++ umask
16:29:35 [2025-04-03T16:29:35.504Z] + '[' 0022 = 0000 ']'
16:29:35 [2025-04-03T16:29:35.504Z] + cd /home/jenkins/agent/workspace/test-override
16:29:35 [2025-04-03T16:29:35.504Z] + cosa shell -- test -d /home/jenkins/agent/workspace/test-override/tmp/kola-iqjrr/kola-x86_64
16:29:35 [2025-04-03T16:29:35.506Z] [Pipeline] }
16:29:35 [2025-04-03T16:29:35.509Z] [Pipeline] // withEnv
16:29:35 [2025-04-03T16:29:35.513Z] [Pipeline] withEnv
16:29:35 [2025-04-03T16:29:35.514Z] [Pipeline] {
16:29:35 [2025-04-03T16:29:35.517Z] [Pipeline] sh
16:29:36 [2025-04-03T16:29:36.060Z] + set -xeuo pipefail
16:29:36 [2025-04-03T16:29:36.060Z] ++ umask
16:29:36 [2025-04-03T16:29:36.060Z] + '[' 0022 = 0000 ']'
16:29:36 [2025-04-03T16:29:36.060Z] + cd /home/jenkins/agent/workspace/test-override
16:29:36 [2025-04-03T16:29:36.060Z] + cosa shell -- tar -C /home/jenkins/agent/workspace/test-override/tmp/kola-iqjrr -c --xz kola-x86_64
16:29:42 [2025-04-03T16:29:42.586Z] [Pipeline] }
16:29:42 [2025-04-03T16:29:42.598Z] [Pipeline] // withEnv
16:29:42 [2025-04-03T16:29:42.616Z] [Pipeline] archiveArtifacts
16:29:42 [2025-04-03T16:29:42.620Z] Archiving artifacts
16:29:45 [2025-04-03T16:29:45.375Z] [Pipeline] withEnv
16:29:45 [2025-04-03T16:29:45.376Z] [Pipeline] {
16:29:45 [2025-04-03T16:29:45.379Z] [Pipeline] sh
16:29:45 [2025-04-03T16:29:45.915Z] + set -xeuo pipefail
16:29:45 [2025-04-03T16:29:45.915Z] ++ umask
16:29:45 [2025-04-03T16:29:45.915Z] + '[' 0022 = 0000 ']'
16:29:45 [2025-04-03T16:29:45.915Z] + cd /home/jenkins/agent/workspace/test-override
16:29:45 [2025-04-03T16:29:45.915Z] + cosa shell -- /usr/lib/coreos-assembler/kola-junit --classname kola-x86_64 --koladir /home/jenkins/agent/workspace/test-override/tmp/kola-iqjrr/kola-x86_64 --output -
16:29:46 [2025-04-03T16:29:46.836Z] [Pipeline] }
16:29:46 [2025-04-03T16:29:46.839Z] [Pipeline] // withEnv
16:29:46 [2025-04-03T16:29:46.844Z] [Pipeline] junit
16:29:46 [2025-04-03T16:29:46.845Z] Recording test results
16:29:47 [2025-04-03T16:29:47.986Z] [Pipeline] }
16:29:47 [2025-04-03T16:29:47.994Z] Failed in branch x86_64
16:29:48 [2025-04-03T16:29:48.001Z] [Pipeline] // parallel
16:29:48 [2025-04-03T16:29:48.010Z] [Pipeline] stage
16:29:48 [2025-04-03T16:29:48.011Z] [Pipeline] { (Report Completion)
16:29:48 [2025-04-03T16:29:48.023Z] [Pipeline] withCredentials
16:29:48 [2025-04-03T16:29:48.076Z] Masking supported pattern matches of $RDB_PASSWORD
16:29:48 [2025-04-03T16:29:48.086Z] [Pipeline] {
16:29:48 [2025-04-03T16:29:48.091Z] [Pipeline] withEnv
16:29:48 [2025-04-03T16:29:48.092Z] [Pipeline] {
16:29:48 [2025-04-03T16:29:48.102Z] [Pipeline] sh
16:29:49 [2025-04-03T16:29:49.734Z] + set -xeuo pipefail
16:29:49 [2025-04-03T16:29:49.734Z] ++ umask
16:29:49 [2025-04-03T16:29:49.734Z] + '[' 0022 = 0000 ']'
16:29:49 [2025-04-03T16:29:49.734Z] + /usr/lib/coreos-assembler/resultsdb-report --testcase cosa.build-and-test --testcase-url https://jenkins-coreos-ci.apps.ocp.fedoraproject.org//job/test-override --testrun-url https://jenkins-coreos-ci.apps.ocp.fedoraproject.org/job/test-override/1602/display/redirect --outcome FAILED --advisory FEDORA-2025-e16f64ee32 --stream rawhide
16:29:49 [2025-04-03T16:29:49.736Z] [Pipeline] }
16:29:49 [2025-04-03T16:29:49.739Z] [Pipeline] // withEnv
16:29:49 [2025-04-03T16:29:49.801Z] [Pipeline] }
16:29:49 [2025-04-03T16:29:49.829Z] [Pipeline] // withCredentials
16:29:49 [2025-04-03T16:29:49.874Z] [Pipeline] withCredentials
16:29:49 [2025-04-03T16:29:49.909Z] Masking supported pattern matches of $TOKEN
16:29:49 [2025-04-03T16:29:49.909Z] [Pipeline] {
16:29:49 [2025-04-03T16:29:49.927Z] [Pipeline] withEnv
16:29:49 [2025-04-03T16:29:49.927Z] [Pipeline] {
16:29:49 [2025-04-03T16:29:49.931Z] [Pipeline] sh
16:29:50 [2025-04-03T16:29:50.471Z] + set -xeuo pipefail
16:29:50 [2025-04-03T16:29:50.471Z] ++ umask
16:29:50 [2025-04-03T16:29:50.471Z] + '[' 0022 = 0000 ']'
16:29:50 [2025-04-03T16:29:50.471Z] + curl -X POST -H 'Content-Type: application/json' -u **** https://maubot.apps.ocp.fedoraproject.org/plugin/nonbot-coreos/send --silent -d '
16:29:50 [2025-04-03T16:29:50.471Z] {
16:29:50 [2025-04-03T16:29:50.471Z] "body": "���� kernel-6.15.0-0.rc0.20250403gita2cc6ff5ec8f.10.fc43 - [����](https://jenkins-coreos-ci.apps.ocp.fedoraproject.org/job/test-override/1602/display/redirect) [����](https://bodhi.fedoraproject.org/updates/FEDORA-2025-e16f64ee32)"
16:29:50 [2025-04-03T16:29:50.471Z] }'
16:29:51 [2025-04-03T16:29:51.030Z] [Pipeline] }
16:29:51 [2025-04-03T16:29:51.033Z] [Pipeline] // withEnv
16:29:51 [2025-04-03T16:29:51.085Z] [Pipeline] }
16:29:51 [2025-04-03T16:29:51.126Z] [Pipeline] // withCredentials
16:29:51 [2025-04-03T16:29:51.145Z] [Pipeline] }
16:29:51 [2025-04-03T16:29:51.166Z] [Pipeline] // stage
16:29:51 [2025-04-03T16:29:51.192Z] [Pipeline] }
16:29:51 [2025-04-03T16:29:51.256Z] [Pipeline] // timeout
16:29:51 [2025-04-03T16:29:51.261Z] [Pipeline] }
16:29:51 [2025-04-03T16:29:51.264Z] [Pipeline] // container
16:29:51 [2025-04-03T16:29:51.274Z] [Pipeline] }
16:29:51 [2025-04-03T16:29:51.280Z] [Pipeline] // node
16:29:51 [2025-04-03T16:29:51.283Z] [Pipeline] }
16:29:51 [2025-04-03T16:29:51.295Z] [Pipeline] // podTemplate
16:29:51 [2025-04-03T16:29:51.372Z] [Pipeline] End of Pipeline
16:29:51 [2025-04-03T16:29:51.398Z] ERROR: Script returned exit code 1
16:29:51 [2025-04-03T16:29:51.556Z] Finished: FAILURE